{"text_format":"1","workbook":"xlsx","n_sheets":5,"sheets":["USER TEC-Tec","BASE TEC-Tec","JAUGE TEC-Tec","CHARTE TEC-Tec","Facteurs de calcul"],"not_rendered":{"charts":20,"images":24,"macros":1,"external_links":0,"defined_names":54,"comments":0,"pivot_tables":0},"unopened":[],"bounds":{"document_bytes":16777216,"sheet_cells":100000,"rows_first":2000,"rows_last":500,"rows_between":2000,"halvings":0,"cell_chars":16384,"cell_head_chars":4096},"cells_cut":0,"cells_raw":0,"read":"whole","date_system":"1900"}

{"sheet":"USER TEC-Tec","index":0,"n_rows":328,"n_cols":12,"rows_kept":328,"cut":false,"hidden":false,"merged":[]}
[]
[]
[null,"Nom du projet  : ","Projet "]
[]
[null,"Résultat : ",{"$f":"SUM(D32,D144,D228,D252)","v":0},null,null,null,null,null,null,"E>0","E>0"]
[]
[null,"Consommation électrique :",{"$f":"D217","v":0}]
[null,"Production d'électricité :",{"$f":"+D222","v":0}]
[]
[null,"Émissions de construction :",{"$f":"IF(D17=0,0,('BASE TEC-Tec'!L130+'BASE TEC-Tec'!L131)/D17*1000)","v":0}]
[null,"Émissions d'exploitation :",{"$f":"IF(D17=0,0,'BASE TEC-Tec'!L396/D17*1000)","v":0}]
[]
[null,{"$f":"UPPER('BASE TEC-Tec'!A4)","v":"DONNÉES GÉNÉRALES"},null,{"$f":"SUM(D32,D144,D228,D252)","v":0},"Valeurs par défaut ","Unité",null,{"$f":"SUM(H32,H144,H228,H252)","v":0},{"$f":"SUM(I32,I144,I228,I252)","v":0},{"$f":"SUM(J32,J144,J228,J252)","v":0},{"$f":"SUM(K32,K144,K228,K252)","v":0},"Commentaires"]
[]
[null,"Nom du projet",null,{"$f":"C3","v":"Projet "},{"$f":"CONCATENATE(C3,\" par défaut\")","v":"Projet  par défaut"},null,null,"Variante A","Variante B","Variante C","Variante D"]
[null,"Type de bâtiment ",null,"-",{"$f":"D16","v":"-"},"liste déroulante",null,"-","-","-","-"]
[null,"Surface utile ",null,0,{"$f":"D17","v":0},{"$f":"'BASE TEC-Tec'!D6","v":"m² utile"},null,0,0,0,0]
[null,"Surface de la parcelle ",null,0,{"$f":"D18","v":0},{"$f":"'BASE TEC-Tec'!D7","v":"m² de foncier"},null,0,0,0,0]
[]
[null,"Jardins","surface",0,{"$f":"'BASE TEC-Tec'!F8","v":0},{"$f":"'BASE TEC-Tec'!D8","v":"m²"},null,0,0,0,0]
[null,"Parking extérieur véhicules","surface",0,{"$f":"'BASE TEC-Tec'!F9","v":0},{"$f":"'BASE TEC-Tec'!D9","v":"m²"},null,0,0,0,0]
[null,"Cheminement extérieur piéton","surface",0,{"$f":"'BASE TEC-Tec'!F10","v":0},{"$f":"'BASE TEC-Tec'!D10","v":"m²"},null,0,0,0,0]
[null,"Planchers","surface hors sous-sol ni coursive ni toiture (SdP)",0,{"$f":"'BASE TEC-Tec'!F11","v":0},{"$f":"'BASE TEC-Tec'!D11","v":"m²"},null,0,0,0,0]
[null,"Sous-sols","surface",0,{"$f":"'BASE TEC-Tec'!F12","v":0},{"$f":"'BASE TEC-Tec'!D12","v":"m²"},null,0,0,0,0]
[null,"Façades","surface",0,{"$f":"'BASE TEC-Tec'!F13","v":0},{"$f":"'BASE TEC-Tec'!D13","v":"m²"},null,0,0,0,0]
[null,"Coursives extérieures","surface",0,{"$f":"'BASE TEC-Tec'!F14","v":0},{"$f":"'BASE TEC-Tec'!D14","v":"m²"},null,0,0,0,0]
[null,"Toitures","surface",0,{"$f":"'BASE TEC-Tec'!F15","v":0},{"$f":"'BASE TEC-Tec'!D15","v":"m²"},null,0,0,0,0]
[]
[null,{"$f":"'BASE TEC-Tec'!B16","v":"Rapport SU/SdP"},null,{"$f":"IF(D23=0,0,D17/D23)","v":0},{"$f":"IF(E23=0,0,'BASE TEC-Tec'!F16)","v":0},{"$f":"'BASE TEC-Tec'!D16","v":"[-]"},null,0,0,0,0]
[null,{"$f":"'BASE TEC-Tec'!B17","v":"Indice de compacité"},"Surface Façades / Surface Planchers",{"$f":"IF(D23=0,0,D25/D23)","v":0},{"$f":"IF(E23=0,0,'BASE TEC-Tec'!F17)","v":0},{"$f":"'BASE TEC-Tec'!D17","v":"[-]"},null,0,0,0,0]
[]
[null,"CONSTRUCTION",null,{"$f":"IF(D$17*D$18=0,0,'BASE TEC-Tec'!R131)","v":0},{"$f":"IF(E$17*E$18=0,0,'BASE TEC-Tec'!S131)","v":0},null,null,0,0,0,0]
[]
[null,{"$f":"UPPER('BASE TEC-Tec'!B19)","v":"CONCEPTION"}]
[null,null,{"$f":"'BASE TEC-Tec'!B20","v":"trajets entre La Réunion et la métropole"},0,{"$f":"'BASE TEC-Tec'!F20","v":0},{"$f":"'BASE TEC-Tec'!D20","v":"aller-retour"},1,0,0,0,0]
[]
[null,{"$f":"UPPER('BASE TEC-Tec'!B22)","v":"CHANGEMENT D'AFFECTATION DES SOLS"}]
[null,null,{"$f":"'BASE TEC-Tec'!B23","v":"artificialisation nette"},0,{"$f":"'BASE TEC-Tec'!F23","v":0},{"$f":"'BASE TEC-Tec'!D23","v":"m²"},1,0,0,0,0]
[]
[null,{"$f":"UPPER('BASE TEC-Tec'!B24)","v":"VOIRIE ET TRAITEMENT PAYSAGER"}]
[null,"Végétalisation",{"$f":"'BASE TEC-Tec'!B25","v":"végétalisation (toiture végétalisée inclue)"},{"$f":"+D20","v":0},{"$f":"'BASE TEC-Tec'!F25","v":0},"m²",1,0,0,0,0]
[]
[null,"Parking",{"$f":"'BASE TEC-Tec'!B26","v":"enrobé neuf"},0,{"$f":"'BASE TEC-Tec'!F26","v":0},"% des parkings extérieurs",1,0,0,0,0]
[null,{"$f":"IF(SUM(D43:D45)>1,\"Erreur : total > 100%\",\"\")","v":""},{"$f":"'BASE TEC-Tec'!B27","v":"dallage en béton"},0,{"$f":"'BASE TEC-Tec'!F27","v":0},{"$f":"F$43","v":"% des parkings extérieurs"},1,0,0,0,0]
[null,null,{"$f":"'BASE TEC-Tec'!B28","v":"pavage béton enherbé"},0,{"$f":"'BASE TEC-Tec'!F28","v":0},{"$f":"F$43","v":"% des parkings extérieurs"},1,0,0,0,0]
[]
[null,"Cheminement",{"$f":"'BASE TEC-Tec'!B29","v":"enrobé neuf"},0,{"$f":"'BASE TEC-Tec'!F29","v":0},"% des cheminements ext.",1,0,0,0,0]
[null,{"$f":"IF(SUM(D47:D49)>1,\"Erreur : total > 100%\",\"\")","v":""},{"$f":"'BASE TEC-Tec'!B30","v":"dallage en béton"},0,{"$f":"'BASE TEC-Tec'!F30","v":0},{"$f":"F$47","v":"% des cheminements ext."},1,0,0,0,0]
[null,null,{"$f":"'BASE TEC-Tec'!B31","v":"matériau perméable"},0,{"$f":"'BASE TEC-Tec'!F31","v":0},{"$f":"F$47","v":"% des cheminements ext."},1,0,0,0,0]
[]
[null,"Clôtures & maçonnerie",{"$f":"'BASE TEC-Tec'!B32","v":"murets maçonnés"},0,{"$f":"'BASE TEC-Tec'!F32","v":0},"m²",1,0,0,0,0]
[null,null,{"$f":"'BASE TEC-Tec'!B33","v":"mur de soutènement"},0,{"$f":"'BASE TEC-Tec'!F33","v":0},"m²",1,0,0,0,0]
[]
[null,{"$f":"UPPER(\"Fondations\")","v":"FONDATIONS"}]
[null,null,{"$f":"'BASE TEC-Tec'!B38","v":"nivellement dans la roche"},0,{"$f":"IF(E17*E18=0,\"-\",'BASE TEC-Tec'!D42)","v":"-"},"sur l'emprise construite",1,0,0,0,0]
[]
[null,{"$f":"IF(SUM(D57:D60)>1,\"Erreur : total > 100%\",\"\")","v":""},{"$f":"'BASE TEC-Tec'!B44","v":"pieux béton"},0,{"$f":"'BASE TEC-Tec'!F44","v":0},"% de la surface fondée",1,0,0,0,0]
[null,null,{"$f":"'BASE TEC-Tec'!B45","v":"micropieux"},0,{"$f":"'BASE TEC-Tec'!F45","v":0},{"$f":"F$57","v":"% de la surface fondée"},1,0,0,0,0]
[null,null,{"$f":"'BASE TEC-Tec'!B46","v":"radier"},0,{"$f":"'BASE TEC-Tec'!F46","v":0},{"$f":"F$57","v":"% de la surface fondée"},1,0,0,0,0]
[null,null,{"$f":"'BASE TEC-Tec'!B47","v":"superficielles"},0,{"$f":"'BASE TEC-Tec'!F47","v":0},{"$f":"F$57","v":"% de la surface fondée"},1,0,0,0,0]
[]
[null,{"$f":"UPPER('BASE TEC-Tec'!B48)","v":"INFRASTRUCTURE"}]
[null,null,{"$f":"'BASE TEC-Tec'!B49","v":"sous-sols"},{"$f":"D24","v":0},{"$f":"'BASE TEC-Tec'!F49","v":0},"m²",1,0,0,0,0]
[null,null,"zone de poutres de reprise",0,{"$f":"'BASE TEC-Tec'!F50","v":0},"m²",1,0,0,0,0]
[]
[null,{"$f":"UPPER('BASE TEC-Tec'!B51)","v":"PLANCHERS"}]
[null,{"$f":"IF(SUM(D67:D71)>1,\"Erreur : total > 100%\",\"\")","v":""},{"$f":"'BASE TEC-Tec'!B52","v":"béton"},0,{"$f":"'BASE TEC-Tec'!F52","v":0},"% planchers + coursives ext.",1,0,0,0,0]
[null,null,{"$f":"'BASE TEC-Tec'!B53","v":"collaborant métal-béton"},0,{"$f":"'BASE TEC-Tec'!F53","v":0},{"$f":"F$67","v":"% planchers + coursives ext."},1,0,0,0,0]
[null,null,{"$f":"'BASE TEC-Tec'!B54","v":"collaborant bois-béton"},0,{"$f":"'BASE TEC-Tec'!F54","v":0},{"$f":"F$67","v":"% planchers + coursives ext."},1,0,0,0,0]
[null,null,{"$f":"'BASE TEC-Tec'!B55","v":"ossature et platelage bois"},0,{"$f":"'BASE TEC-Tec'!F55","v":0},{"$f":"F$67","v":"% planchers + coursives ext."},1,0,0,0,0]
[null,null,{"$f":"'BASE TEC-Tec'!B56","v":"bois plein (CLT)"},0,{"$f":"'BASE TEC-Tec'!F56","v":0},{"$f":"F$67","v":"% planchers + coursives ext."},1,0,0,0,0]
[]
[null,{"$f":"UPPER('BASE TEC-Tec'!B57)","v":"OSSATURE PRINCIPALE"}]
[null,{"$f":"IF(SUM(D74:D79)>1,\"Erreur : total > 100%\",\"\")","v":""},{"$f":"'BASE TEC-Tec'!B58","v":"voiles de refend en béton"},0,{"$f":"'BASE TEC-Tec'!F58","v":0},"% de la surface de planchers",1,0,0,0,0]
[null,null,{"$f":"'BASE TEC-Tec'!B59","v":"murs en matériaux locaux"},0,{"$f":"'BASE TEC-Tec'!F59","v":0},{"$f":"F$74","v":"% de la surface de planchers"},1,0,0,0,0]
[null,null,{"$f":"'BASE TEC-Tec'!B60","v":"ossature béton"},0,{"$f":"'BASE TEC-Tec'!F60","v":0},{"$f":"F$74","v":"% de la surface de planchers"},1,0,0,0,0]
[null,null,{"$f":"'BASE TEC-Tec'!B61","v":"ossature métal"},0,{"$f":"'BASE TEC-Tec'!F61","v":0},{"$f":"F$74","v":"% de la surface de planchers"},1,0,0,0,0]
[null,null,{"$f":"'BASE TEC-Tec'!B62","v":"ossature bois"},0,{"$f":"'BASE TEC-Tec'!F62","v":0},{"$f":"F$74","v":"% de la surface de planchers"},1,0,0,0,0]
[null,null,{"$f":"'BASE TEC-Tec'!B63","v":"bois massif (CLT)"},0,{"$f":"'BASE TEC-Tec'!F63","v":0},{"$f":"F$74","v":"% de la surface de planchers"},1,0,0,0,0]
[]
[null,{"$f":"UPPER('BASE TEC-Tec'!B64)","v":"REMPLISSAGE DE FAÇADE"}]
[null,{"$f":"IF(SUM(D82:D91)>1,\"Attention : total > 100%\",\"\")","v":""},{"$f":"'BASE TEC-Tec'!B65","v":"voiles béton"},0,{"$f":"'BASE TEC-Tec'!F65","v":0},"% de la surface de façade",1,0,0,0,0]
[null,null,{"$f":"'BASE TEC-Tec'!B66","v":"maçonnerie"},0,{"$f":"'BASE TEC-Tec'!F66","v":0},{"$f":"F$82","v":"% de la surface de façade"},1,0,0,0,0]
[null,null,{"$f":"'BASE TEC-Tec'!B67","v":"métallique"},0,{"$f":"'BASE TEC-Tec'!F67","v":0},"% de la surface de façade",1,0,0,0,0]
[null,null,{"$f":"'BASE TEC-Tec'!B68","v":"mur en terre"},0,{"$f":"'BASE TEC-Tec'!F68","v":0},"% de la surface de façade",1,0,0,0,0]
[null,null,{"$f":"'BASE TEC-Tec'!B69","v":"ossature bois"},0,{"$f":"'BASE TEC-Tec'!F69","v":0},"% de la surface de façade",1,0,0,0,0]
[null,null,{"$f":"'BASE TEC-Tec'!B70","v":"mur rideau acier et aluminium"},0,{"$f":"'BASE TEC-Tec'!F70","v":0},"% de la surface de façade",1,0,0,0,0]
[null,null,{"$f":"'BASE TEC-Tec'!B71","v":"châssis acier vitré"},0,{"$f":"'BASE TEC-Tec'!F71","v":0},"% de la surface de façade",1,0,0,0,0]
[null,null,{"$f":"'BASE TEC-Tec'!B72","v":"châssis aluminium vitré"},0,{"$f":"'BASE TEC-Tec'!F72","v":0},"% de la surface de façade",1,0,0,0,0]
[null,null,{"$f":"'BASE TEC-Tec'!B73","v":"châssis PVC vitré"},0,{"$f":"'BASE TEC-Tec'!F73","v":0},"% de la surface de façade",1,0,0,0,0]
[null,null,{"$f":"'BASE TEC-Tec'!B74","v":"châssis bois vitré"},0,{"$f":"'BASE TEC-Tec'!F74","v":0},"% de la surface de façade",1,0,0,0,0]
[]
[null,{"$f":"UPPER('BASE TEC-Tec'!B75)","v":"REVÊTEMENT DE FAÇADE"}]
[null,{"$f":"IF(SUM(D94:D100)>1,\"Erreur : total > 100%\",\"\")","v":""},{"$f":"'BASE TEC-Tec'!B76","v":"peinture"},0,{"$f":"'BASE TEC-Tec'!F76","v":0},{"$f":"F82","v":"% de la surface de façade"},1,0,0,0,0]
[null,null,{"$f":"'BASE TEC-Tec'!B77","v":"enduit"},0,{"$f":"'BASE TEC-Tec'!F77","v":0},{"$f":"F$94","v":"% de la surface de façade"},1,0,0,0,0]
[null,{"$f":"IF(SUM(D94:D100)>SUM(D82:D86),\"Erreur : total > % de façades opaques\",\"\")","v":""},{"$f":"'BASE TEC-Tec'!B78","v":"briquette ou pierre"},0,{"$f":"'BASE TEC-Tec'!F78","v":0},"% de la surface de façade",1,0,0,0,0]
[null,null,{"$f":"'BASE TEC-Tec'!B79","v":"panneaux minéraux"},0,{"$f":"'BASE TEC-Tec'!F79","v":0},"% de la surface de façade",1,0,0,0,0]
[null,null,{"$f":"'BASE TEC-Tec'!B80","v":"bardage acier"},0,{"$f":"'BASE TEC-Tec'!F80","v":0},"% de la surface de façade",1,0,0,0,0]
[null,null,{"$f":"'BASE TEC-Tec'!B81","v":"bardage aluminium"},0,{"$f":"'BASE TEC-Tec'!F81","v":0},"% de la surface de façade",1,0,0,0,0]
[null,null,{"$f":"'BASE TEC-Tec'!B82","v":"bardage bois"},0,{"$f":"'BASE TEC-Tec'!F82","v":0},"% de la surface de façade",1,0,0,0,0]
[]
[null,{"$f":"UPPER('BASE TEC-Tec'!B83)","v":"PROTECTIONS SOLAIRES EXTÉRIEURES"}]
[null,{"$f":"IF(SUM(D103:D104)>1,\"Erreur : total > 100%\",\"\")","v":""},{"$f":"'BASE TEC-Tec'!B84","v":"brise-soleil en toile ou en bois"},0,{"$f":"'BASE TEC-Tec'!F84","v":0},{"$f":"F$94","v":"% de la surface de façade"},1,0,0,0,0]
[null,null,{"$f":"'BASE TEC-Tec'!B85","v":"brise-soleil en aluminium"},0,{"$f":"'BASE TEC-Tec'!F85","v":0},{"$f":"F$94","v":"% de la surface de façade"},1,0,0,0,0]
[null,null,{"$f":"'BASE TEC-Tec'!B86","v":"motorisation des brise-soleil"},"-",{"$f":"IF($E$17*$E$18=0,\"-\",\"oui\")","v":"-"},"liste déroulante",1,"-","-","-","-"]
[null,{"$f":"IF(SUM(D106:D107)>1,\"Erreur : total > 100%\",\"\")","v":""},{"$f":"'BASE TEC-Tec'!B91","v":"casquette (et/ou joue) bois"},0,{"$f":"'BASE TEC-Tec'!F91","v":0},{"$f":"F$94","v":"% de la surface de façade"},1,0,0,0,0]
[null,null,{"$f":"'BASE TEC-Tec'!B92","v":"casquette (et/ou joue) métal"},0,{"$f":"'BASE TEC-Tec'!F92","v":0},{"$f":"F$94","v":"% de la surface de façade"},1,0,0,0,0]
[null,null,{"$f":"'BASE TEC-Tec'!B93","v":"casquette (et/ou joue) béton"},0,{"$f":"'BASE TEC-Tec'!F93","v":0.39999999999999997},{"$f":"F$94","v":"% de la surface de façade"},1,0,0,0,0]
[]
[null,{"$f":"UPPER('BASE TEC-Tec'!B94)","v":"TOITURE"}]
[null,"Toiture terrasse",{"$f":"'BASE TEC-Tec'!B95","v":"dalle béton"},0,{"$f":"'BASE TEC-Tec'!F95","v":0},"% de la surface de toiture",1,0,0,0,0]
[null,{"$f":"IF(SUM(D111:D112)>1,\"Erreur : total > 100%\",\"\")","v":""},{"$f":"'BASE TEC-Tec'!B96","v":"plancher bois"},0,{"$f":"'BASE TEC-Tec'!F96","v":0},{"$f":"F$111","v":"% de la surface de toiture"},1,0,0,0,0]
[]
[null,"Toiture en pente ou sur-toiture",{"$f":"'BASE TEC-Tec'!B97","v":"charpente métallique"},0,{"$f":"'BASE TEC-Tec'!F97","v":0},{"$f":"F$111","v":"% de la surface de toiture"},1,0,0,0,0]
[null,{"$f":"IF(SUM(D114:D115)>1,\"Erreur : total > 100%\",\"\")","v":""},{"$f":"'BASE TEC-Tec'!B98","v":"charpente bois"},0,{"$f":"'BASE TEC-Tec'!F98","v":0},{"$f":"F$111","v":"% de la surface de toiture"},1,0,0,0,0]
[]
[null,"Couverture",{"$f":"'BASE TEC-Tec'!B99","v":"revêtement d'étanchéité"},0,{"$f":"'BASE TEC-Tec'!F99","v":0},{"$f":"F$111","v":"% de la surface de toiture"},1,0,0,0,0]
[null,{"$f":"IF(SUM(D117:D119)>1,\"Erreur : total > 100%\",\"\")","v":""},{"$f":"'BASE TEC-Tec'!B100","v":"couverte en tôle"},0,{"$f":"'BASE TEC-Tec'!F100","v":0},{"$f":"F$111","v":"% de la surface de toiture"},1,0,0,0,0]
[null,null,{"$f":"'BASE TEC-Tec'!B101","v":"couverture biosourcée"},0,{"$f":"'BASE TEC-Tec'!F101","v":0},{"$f":"F$111","v":"% de la surface de toiture"},1,0,0,0,0]
[]
[null,{"$f":"UPPER('BASE TEC-Tec'!B102)","v":"ISOLATION"}]
[null,{"$f":"IF(SUM(D123:D124)>1,\"Erreur : total > 100%\",\"\")","v":""},{"$f":"'BASE TEC-Tec'!B103","v":"toiture"},"-",{"$f":"IF($E$17*$E$18=0,\"-\",'BASE TEC-Tec'!D106)","v":"-"},"liste déroulante",1,"-","-","-","-"]
[null,null,{"$f":"'BASE TEC-Tec'!B109","v":"façades avec isolant conventionnel"},0,{"$f":"'BASE TEC-Tec'!F109","v":0},{"$f":"F$94","v":"% de la surface de façade"},1,0,0,0,0]
[null,null,{"$f":"'BASE TEC-Tec'!B110","v":"façades avec isolant biosourcé"},0,{"$f":"'BASE TEC-Tec'!F110","v":0},{"$f":"F$94","v":"% de la surface de façade"},1,0,0,0,0]
[]
[null,{"$f":"UPPER('BASE TEC-Tec'!B111)","v":"HABILLAGES INTÉRIEURS"}]
[null,null,{"$f":"'BASE TEC-Tec'!B112","v":"faux-plafond minéral"},0,{"$f":"'BASE TEC-Tec'!F112","v":0},"% de la surface utile",1,0,0,0,0]
[null,null,{"$f":"'BASE TEC-Tec'!B113","v":"faux-plancher technique"},0,{"$f":"'BASE TEC-Tec'!F113","v":0},{"$f":"F$127","v":"% de la surface utile"},1,0,0,0,0]
[]
[null,{"$f":"UPPER('BASE TEC-Tec'!B115)","v":"PRODUCTION LOCALE D'ENR"}]
[null,null,{"$f":"'BASE TEC-Tec'!B116","v":"installation solaire thermique"},0,{"$f":"'BASE TEC-Tec'!F116","v":0},{"$f":"'BASE TEC-Tec'!D116","v":"m² de panneaux"},1,0,0,0,0]
[null,null,{"$f":"'BASE TEC-Tec'!B117","v":"installation photovoltaïque sans batterie"},0,{"$f":"'BASE TEC-Tec'!F117","v":0},{"$f":"'BASE TEC-Tec'!D117","v":"kWc"},1,0,0,0,0]
[null,null,{"$f":"'BASE TEC-Tec'!B118","v":"installation photovoltaïque avec batteries"},0,{"$f":"'BASE TEC-Tec'!F118","v":0},{"$f":"'BASE TEC-Tec'!D118","v":"kWc"},1,0,0,0,0]
[]
[null,{"$f":"UPPER('BASE TEC-Tec'!B119)","v":"VARIATION D'ALBÉDO"}]
[null,{"$f":"IF(SUM(D136:D139)>1,\"Erreur : total > 100%\",\"\")","v":""},{"$f":"'BASE TEC-Tec'!B120","v":"ton presque inchangé"},0,{"$f":"'BASE TEC-Tec'!F120","v":0},"% de la surface de la parcelle",1,0,0,0,0]
[null,null,{"$f":"'BASE TEC-Tec'!B121","v":"fonçage (couleur foncée → noir)"},0,{"$f":"'BASE TEC-Tec'!F121","v":0},{"$f":"F$136","v":"% de la surface de la parcelle"},1,0,0,0,0]
[null,null,{"$f":"'BASE TEC-Tec'!B122","v":"éclaircissement (couleur foncée → couleur moyenne)"},0,{"$f":"'BASE TEC-Tec'!F122","v":0},{"$f":"F$136","v":"% de la surface de la parcelle"},1,0,0,0,0]
[null,null,{"$f":"'BASE TEC-Tec'!B123","v":"fort éclaircissement (couleur foncée → couleur très claire)"},0,{"$f":"'BASE TEC-Tec'!F123","v":0},{"$f":"F$136","v":"% de la surface de la parcelle"},1,0,0,0,0]
[]
[null,{"$f":"UPPER('BASE TEC-Tec'!B124)","v":"INSTALLATION DE CHANTIER"}]
[null,null,{"$f":"'BASE TEC-Tec'!B125","v":"organisation"},"-",{"$f":"IF($E$17*$E$18=0,\"-\",'BASE TEC-Tec'!D127)","v":"-"},"liste déroulante",1,"-","-","-","-"]
[]
[null,"ÉNERGIE",null,{"$f":"IF(D$17*D$18=0,0,'BASE TEC-Tec'!R297)","v":0},{"$f":"IF(E$17*E$18=0,0,'BASE TEC-Tec'!S297)","v":0},null,null,0,0,0,0]
[]
[null,{"$f":"UPPER('BASE TEC-Tec'!B134)","v":"RAFRAÎCHISSEMENT POUR LE CONFORT"}]
[null,null,{"$f":"'BASE TEC-Tec'!B136","v":"performance de l'enveloppe et de son environnement"},"-",{"$f":"IF(E17*E18=0,\"-\",'BASE TEC-Tec'!D138)","v":"-"},"liste déroulante",null,"-","-","-","-"]
[]
[null,null,{"$f":"'BASE TEC-Tec'!B135","v":"zone en ventilation naturelle + brasseurs d'air"},0,{"$f":"'BASE TEC-Tec'!F135","v":0},{"$f":"'BASE TEC-Tec'!D135","v":"m²"},null,0,0,0,0]
[]
[null,null,{"$f":"'BASE TEC-Tec'!B142","v":"zone en climatisation + ventilation naturelle + brasseurs d'air"},0,{"$f":"'BASE TEC-Tec'!F142","v":0},{"$f":"'BASE TEC-Tec'!D142","v":"m²"},null,0,0,0,0]
[null,null,{"$f":"'BASE TEC-Tec'!B147","v":"durée de fonctionnement de la climatisation"},"-",{"$f":"IF(E17*E18=0,\"-\",'BASE TEC-Tec'!D151)","v":"-"},"liste déroulante",null,"-","-","-","-"]
[]
[null,null,{"$f":"'BASE TEC-Tec'!B153","v":"zone en climatisation + brasseurs d'air"},0,{"$f":"'BASE TEC-Tec'!F153","v":0},{"$f":"'BASE TEC-Tec'!D153","v":"m²"},null,0,0,0,0]
[null,null,{"$f":"'BASE TEC-Tec'!B158","v":"durée de fonctionnement de la climatisation"},"-",{"$f":"IF(E17*E18=0,\"-\",'BASE TEC-Tec'!D161)","v":"-"},"liste déroulante",null,"-","-","-","-"]
[]
[null,null,{"$f":"'BASE TEC-Tec'!B163","v":"zone en climatisation seule (hors locaux techniques)"},0,{"$f":"'BASE TEC-Tec'!F163","v":0},{"$f":"'BASE TEC-Tec'!D163","v":"m²"},null,0,0,0,0]
[null,null,{"$f":"'BASE TEC-Tec'!B168","v":"durée de fonctionnement"},"-",{"$f":"IF(E17*E18=0,\"-\",'BASE TEC-Tec'!D171)","v":"-"},"liste déroulante",null,"-","-","-","-"]
[]
[null,null,{"$f":"'BASE TEC-Tec'!B173","v":"surface totale des quatre zones ci-dessus"},{"$f":"D149+D151+D154+D157","v":0},{"$f":"'BASE TEC-Tec'!F173","v":0},{"$f":"'BASE TEC-Tec'!D173","v":"m²"},null,0,0,0,0]
[]
[null,null,"consommation électrique des zones",{"$f":"ROUND(D160*'BASE TEC-Tec'!E174/100,0)*100","v":0},{"$f":"ROUND(E160*'BASE TEC-Tec'!F174/100,0)*100","v":{"$error":"#VALUE!"}},{"$f":"'BASE TEC-Tec'!D134","v":"kWh / an"},1,0,0,0,0]
[null,null,"consommation électrique unitaire",{"$f":"IF(D17=0,0,D162/D17)","v":0},{"$f":"IF(E17=0,0,E162/E17)","v":0},"kWh / m² utile / an",null,0,0,0,0]
[null,null,{"$f":"'BASE TEC-Tec'!B176","v":"puissance installée avec fluide HFC"},{"$f":"IF(D17=0,\"0\",'BASE TEC-Tec'!E176)","v":"0"},{"$f":"IF(E17=0,\"0\",'BASE TEC-Tec'!F176)","v":"0"},{"$f":"'BASE TEC-Tec'!D176","v":"kW frigo."},1,"0","0","0","0"]
[]
[null,{"$f":"UPPER('BASE TEC-Tec'!B179)","v":"ÉCLAIRAGE INTÉRIEUR"}]
[null,null,{"$f":"'BASE TEC-Tec'!B180","v":"proportion d'éclairement standard (vs surface de vente)"},1,{"$f":"'BASE TEC-Tec'!$F180","v":1},"% de la surface utile",null,1,1,1,1]
[null,null,{"$f":"'BASE TEC-Tec'!B182","v":"performance des équipements et optimisation d'installation"},"-",{"$f":"IF(E17*E18=0,\"-\",'BASE TEC-Tec'!D184)","v":"-"},"liste déroulante",null,"-","-","-","-"]
[null,null,{"$f":"'BASE TEC-Tec'!B187","v":"plage de fonctionnement"},"-",{"$f":"IF(E17*E18=0,\"-\",'BASE TEC-Tec'!D191)","v":"-"},"liste déroulante",null,"-","-","-","-"]
[null,null,"consommation électrique",{"$f":"IF(OR(D168=\"-\",D169=\"-\"),0,ROUND(D17*'BASE TEC-Tec'!E193/100,0)*100)","v":0},{"$f":"IF(OR(E168=\"-\",E169=\"-\"),0,ROUND(E17*'BASE TEC-Tec'!F193/100,0)*100)","v":0},{"$f":"'BASE TEC-Tec'!D179","v":"kWh / an"},1,0,0,0,0]
[null,null,"consommation électrique unitaire",{"$f":"IF(D17=0,0,D170/D17)","v":0},{"$f":"IF(E17=0,0,E170/E17)","v":0},"kWh / m² utile / an",null,0,0,0,0]
[]
[null,{"$f":"UPPER('BASE TEC-Tec'!B194)","v":"ÉCLAIRAGE EXTÉRIEUR"}]
[null,null,{"$f":"'BASE TEC-Tec'!B195","v":"gestion de l'éclairage"},"-",{"$f":"IF(E17*E18=0,\"-\",'BASE TEC-Tec'!D198)","v":"-"},"liste déroulante",null,"-","-","-","-"]
[null,null,{"$f":"'BASE TEC-Tec'!B201","v":"zones éclairées"},"-",{"$f":"IF(E17*E18=0,\"-\",'BASE TEC-Tec'!D204)","v":"-"},"liste déroulante",null,"-","-","-","-"]
[null,null,"consommation électrique",{"$f":"IF(OR(D174=\"-\",D175=\"-\"),0,ROUND(D17*'BASE TEC-Tec'!E206/100,0)*100)","v":0},{"$f":"IF(OR(E174=\"-\",E175=\"-\"),0,ROUND(E17*'BASE TEC-Tec'!F206/100,0)*100)","v":0},{"$f":"'BASE TEC-Tec'!D194","v":"kWh / an"},1,0,0,0,0]
[null,null,"consommation électrique unitaire",{"$f":"IF(D17=0,0,D176/D17)","v":0},{"$f":"IF(E17=0,0,E176/E17)","v":0},"kWh / m² utile / an",null,0,0,0,0]
[]
[null,{"$f":"UPPER('BASE TEC-Tec'!B207)","v":"TRAITEMENT D'AIR TECHNIQUE"}]
[null,null,{"$f":"'BASE TEC-Tec'!B208","v":"locaux techniques climatisés"},0,{"$f":"'BASE TEC-Tec'!$H208","v":0},{"$f":"'BASE TEC-Tec'!D208","v":"pièce"},null,0,0,0,0]
[null,null,{"$f":"'BASE TEC-Tec'!B212","v":"installation VMC des sanitaires"},"-",{"$f":"IF(E17*E18=0,\"-\",'BASE TEC-Tec'!D215)","v":"-"},"liste déroulante",null,"-","-","-","-"]
[null,null,"consommation électrique",{"$f":"ROUND(('BASE TEC-Tec'!E208*'BASE TEC-Tec'!E209+D17*'BASE TEC-Tec'!E212*'BASE TEC-Tec'!E216)/100,0)*100","v":0},{"$f":"ROUND(('BASE TEC-Tec'!F208*'BASE TEC-Tec'!F209+E17*'BASE TEC-Tec'!F212*'BASE TEC-Tec'!F216)/100,0)*100","v":0},{"$f":"'BASE TEC-Tec'!D207","v":"kWh / an"},1,0,0,0,0]
[null,null,"consommation électrique unitaire",{"$f":"IF(D17=0,0,D182/D17)","v":0},{"$f":"IF(E17=0,0,E182/E17)","v":0},"kWh / m² utile / an",null,0,0,0,0]
[]
[null,{"$f":"UPPER('BASE TEC-Tec'!B217)","v":"FORCES MOTRICES"}]
[null,null,{"$f":"'BASE TEC-Tec'!B218","v":"ascenseurs ou monte-charges"},0,{"$f":"'BASE TEC-Tec'!$H218","v":0},{"$f":"'BASE TEC-Tec'!D218","v":"u"},null,0,0,0,0]
[null,null,"consommation électrique",{"$f":"ROUND('BASE TEC-Tec'!E218*'BASE TEC-Tec'!E219/100,0)*100","v":0},{"$f":"ROUND('BASE TEC-Tec'!F218*'BASE TEC-Tec'!F219/100,0)*100","v":0},{"$f":"'BASE TEC-Tec'!D217","v":"kWh / an"},1,0,0,0,0]
[]
[null,{"$f":"UPPER('BASE TEC-Tec'!B220)","v":"CUISINE"}]
[null,null,{"$f":"'BASE TEC-Tec'!B223","v":"type de cuisine"},"-",{"$f":"IF(E17*E18=0,\"-\",'BASE TEC-Tec'!D226)","v":"-"},"liste déroulante",null,"-","-","-","-"]
[null,null,{"$f":"'BASE TEC-Tec'!B230","v":"eau chaude pour la cuisine"},"-",{"$f":"IF(E17*E18=0,\"-\",'BASE TEC-Tec'!D233)","v":"-"},"liste déroulante",null,"-","-","-","-"]
[null,null,{"$f":"'BASE TEC-Tec'!B237","v":"fréquentation (dimensionnement)"},0,{"$f":"'BASE TEC-Tec'!$H237","v":0},{"$f":"'BASE TEC-Tec'!D237","v":"couverts / jour"},null,0,0,0,0]
[null,null,"consommation de gaz",{"$f":"IF(D190=\"-\",0,ROUND(D17*'BASE TEC-Tec'!E238/100,0)*100)","v":0},{"$f":"IF(E190=\"-\",0,ROUND(E17*'BASE TEC-Tec'!F238/100,0)*100)","v":0},{"$f":"'BASE TEC-Tec'!D221","v":"kWh / an"},1,0,0,0,0]
[null,null,"consommation électrique",{"$f":"IF(D190=\"-\",0,ROUND(D17*'BASE TEC-Tec'!E239/100,0)*100)","v":0},{"$f":"IF(E190=\"-\",0,ROUND(E17*'BASE TEC-Tec'!F239/100,0)*100)","v":0},{"$f":"'BASE TEC-Tec'!D222","v":"kWh / an"},1,0,0,0,0]
[]
[null,{"$f":"UPPER('BASE TEC-Tec'!B240)","v":"PRISES DE COURANT"}]
[null,null,"gestion des PC permanentes","-",{"$f":"IF(E17*E18=0,\"-\",'BASE TEC-Tec'!D242)","v":"-"},"liste déroulante",null,"-","-","-","-"]
[null,null,"conso. électrique des PC permanentes",{"$f":"IF(D197=\"-\",0,ROUND(D17*'BASE TEC-Tec'!E240*'BASE TEC-Tec'!E245/100,0)*100)","v":0},{"$f":"IF(E197=\"-\",0,ROUND(E17*'BASE TEC-Tec'!F240*'BASE TEC-Tec'!F245/100,0)*100)","v":0},{"$f":"'BASE TEC-Tec'!D244","v":"kWh / an"},1,0,0,0,0]
[null,null,"matériel de bureautique","-",{"$f":"IF(E17*E18=0,\"-\",'BASE TEC-Tec'!D248)","v":"-"},"liste déroulante",null,"-","-","-","-"]
[null,null,"conso. électrique des PC intermittentes",{"$f":"IF(D199=\"-\",0,ROUND(D17*'BASE TEC-Tec'!E246*'BASE TEC-Tec'!E251/100,0)*100)","v":0},{"$f":"IF(E199=\"-\",0,ROUND(E17*'BASE TEC-Tec'!F246*'BASE TEC-Tec'!F251/100,0)*100)","v":0},{"$f":"'BASE TEC-Tec'!D250","v":"kWh / an"},1,0,0,0,0]
[null,null,"consommation électrique unitaire",{"$f":"IF(D17=0,0,(D198+D200)/D17)","v":0},{"$f":"IF(E17=0,0,(E198+E200)/E17)","v":0},"kWh / m² utile / an",null,0,0,0,0]
[]
[null,{"$f":"UPPER('BASE TEC-Tec'!B252)","v":"EAU CHAUDE SANITAIRE"}]
[null,null,"type","-",{"$f":"IF(E17*E18=0,\"-\",'BASE TEC-Tec'!D259)","v":"-"},"liste déroulante",null,"-","-","-","-"]
[null,null,"consommation électrique",{"$f":"IF(D204=\"-\",0,ROUND(D17*'BASE TEC-Tec'!E253/100,0)*100)","v":0},{"$f":"IF(E204=\"-\",0,ROUND(E17*'BASE TEC-Tec'!F253/100,0)*100)","v":0},{"$f":"'BASE TEC-Tec'!D252","v":"kWh électrique / an"},1,0,0,0,0]
[]
[null,{"$f":"UPPER('BASE TEC-Tec'!B261)","v":"FROID COMMERCIAL"}]
[null,null,{"$f":"'BASE TEC-Tec'!B262","v":"surface de chambres froides positives"},0,{"$f":"'BASE TEC-Tec'!F262","v":0},{"$f":"'BASE TEC-Tec'!D262","v":"m²"},null,0,0,0,0]
[null,null,{"$f":"'BASE TEC-Tec'!B263","v":"surface de chambres froides négatives"},0,{"$f":"'BASE TEC-Tec'!F263","v":0},{"$f":"'BASE TEC-Tec'!D263","v":"m²"},null,0,0,0,0]
[null,null,{"$f":"'BASE TEC-Tec'!B264","v":"performance des systèmes"},"-",{"$f":"IF(E2*E3=0,\"-\",'BASE TEC-Tec'!D267)","v":"-"},"liste déroulante",null,"-","-","-","-"]
[null,null,{"$f":"'BASE TEC-Tec'!B273","v":"meubles frigorifiques de vente"},0,{"$f":"'BASE TEC-Tec'!F273","v":0},{"$f":"'BASE TEC-Tec'!D273","v":"mL"},null,0,0,0,0]
[null,null,{"$f":"'BASE TEC-Tec'!B274","v":"performance des systèmes"},"-",{"$f":"IF(E2*E3=0,\"-\",'BASE TEC-Tec'!D277)","v":"-"},"liste déroulante",null,"-","-","-","-"]
[null,null,"consommation électrique",{"$f":"IF(D208+D211=0,0,ROUND('BASE TEC-Tec'!E279/100,0)*100)","v":0},{"$f":"IF(E208+E211=0,0,ROUND('BASE TEC-Tec'!F279/100,0)*100)","v":0},"kWh / an",1,0,0,0,0]
[]
[null,{"$f":"UPPER(\"Indications de calcul\")","v":"INDICATIONS DE CALCUL"}]
[null,null,"consommation électrique totale",{"$f":"IF(D17*D18=0,0,'BASE TEC-Tec'!E280)","v":0},{"$f":"IF(E17*E18=0,0,'BASE TEC-Tec'!F280)","v":0},"kWh / an",null,0,0,0,0]
[null,null,"consommation électrique unitaire",{"$f":"IF(D17=0,0,'BASE TEC-Tec'!E280/D17)","v":0},{"$f":"IF(E17=0,0,'BASE TEC-Tec'!F280/E17)","v":0},"kWh / m² utile / an",null,0,0,0,0]
[]
[null,{"$f":"UPPER('BASE TEC-Tec'!B281)","v":"PRODUCTION D'ÉLECTRICITÉ"}]
[null,null,{"$f":"'BASE TEC-Tec'!B282","v":"en phase avec l'ensoleillement"},{"$f":"IF(D17=0,0,'BASE TEC-Tec'!E282)","v":0},{"$f":"IF(E17=0,0,'BASE TEC-Tec'!F282)","v":0},{"$f":"'BASE TEC-Tec'!D282","v":"kWh / an"},1,0,0,0,0]
[null,null,{"$f":"'BASE TEC-Tec'!B284","v":"lissée grâce aux batteries"},{"$f":"IF(D17=0,0,'BASE TEC-Tec'!E284)","v":0},{"$f":"IF(E17=0,0,'BASE TEC-Tec'!F284)","v":0},{"$f":"'BASE TEC-Tec'!D284","v":"kWh / an"},1,0,0,0,0]
[null,null,"production électrique unitaire",{"$f":"IF(D17=0,0,'BASE TEC-Tec'!E281/D17)","v":0},{"$f":"IF(E17=0,0,'BASE TEC-Tec'!F281/E17)","v":0},"kWh / m² utile / an",null,0,0,0,0]
[]
[null,{"$f":"UPPER('BASE TEC-Tec'!B286)","v":"COMMISSIONNEMENT ET EXPLOITATION"}]
[null,null,{"$f":"'BASE TEC-Tec'!B287","v":"commissionnement"},"-",{"$f":"IF(E17*E18=0,\"-\",'BASE TEC-Tec'!D290)","v":"-"},"liste déroulante",1,"-","-","-","-"]
[null,null,{"$f":"'BASE TEC-Tec'!B291","v":"gestion de l'exploitation"},"-",{"$f":"IF(E17*E18=0,\"-\",'BASE TEC-Tec'!D294)","v":"-"},"liste déroulante",1,"-","-","-","-"]
[]
[null,"DÉPLACEMENTS",null,{"$f":"IF(E$17*E$18=0,0,'BASE TEC-Tec'!R367)","v":0},{"$f":"IF(E$17*E$18=0,0,'BASE TEC-Tec'!S367)","v":0},null,null,0,0,0,0]
[]
[null,null,"effectif quotidien",0,{"$f":"IF(E$17*E$18=0,0,'BASE TEC-Tec'!$F299)","v":0},"nombre / jour",1,0,0,0,0]
[]
[null,{"$f":"UPPER('BASE TEC-Tec'!B300)","v":"PERSONNEL"}]
[null,null,{"$f":"'BASE TEC-Tec'!B301","v":"distance moyenne depuis le domicile"},0,{"$f":"IF(E$17*E$18=0,0,'BASE TEC-Tec'!$H301)","v":0},{"$f":"'BASE TEC-Tec'!D301","v":"km aller"},1,0,0,0,0]
[null,null,{"$f":"'BASE TEC-Tec'!B302","v":"taux de télétravail (ou de tiers-lieu local)"},0,{"$f":"IF(E$17*E$18=0,0,'BASE TEC-Tec'!$H302)","v":0},{"$f":"'BASE TEC-Tec'!D302","v":"% hebdo."},1,0,0,0,0]
[null,null,{"$f":"'BASE TEC-Tec'!B303","v":"disponibilité de transports en commun"},"-",{"$f":"IF(E17*E18=0,\"-\",'BASE TEC-Tec'!D307)","v":"-"},"liste déroulante",1,"-","-","-","-"]
[null,null,{"$f":"'BASE TEC-Tec'!B309","v":"emplacements de voitures électriques"},"-",{"$f":"IF(E17*E18=0,\"-\",'BASE TEC-Tec'!D311)","v":"-"},"liste déroulante",1,"-","-","-","-"]
[null,null,{"$f":"'BASE TEC-Tec'!B315","v":"emplacements pour deux-roues"},"-",{"$f":"IF(E17*E18=0,\"-\",'BASE TEC-Tec'!D318)","v":"-"},"liste déroulante",1,"-","-","-","-"]
[]
[null,{"$f":"UPPER('BASE TEC-Tec'!B321)","v":"ÉLÈVES OU ÉTUDIANTS"}]
[null,null,{"$f":"'BASE TEC-Tec'!B322","v":"distance moyenne depuis le domicile"},0,{"$f":"IF(E$17*E$18=0,0,'BASE TEC-Tec'!$H322)","v":0},{"$f":"'BASE TEC-Tec'!D322","v":"km aller"},1,0,0,0,0]
[null,null,{"$f":"'BASE TEC-Tec'!B323","v":"taux de télétravail (ou de tiers-lieu local)"},0,{"$f":"IF(E$17*E$18=0,0,'BASE TEC-Tec'!$H323)","v":0},{"$f":"'BASE TEC-Tec'!D323","v":"% hebdo."},1,0,0,0,0]
[null,null,{"$f":"'BASE TEC-Tec'!B324","v":"disponibilité de transports en commun"},"-",{"$f":"IF(E17*E18=0,\"-\",'BASE TEC-Tec'!D328)","v":"-"},"liste déroulante",1,"-","-","-","-"]
[null,null,{"$f":"'BASE TEC-Tec'!B330","v":"emplacements de voitures électriques"},"-",{"$f":"IF(E17*E18=0,\"-\",'BASE TEC-Tec'!D332)","v":"-"},"liste déroulante",1,"-","-","-","-"]
[null,null,{"$f":"'BASE TEC-Tec'!B336","v":"emplacements pour deux-roues"},"-",{"$f":"IF(E17*E18=0,\"-\",'BASE TEC-Tec'!D339)","v":"-"},"liste déroulante",1,"-","-","-","-"]
[]
[null,{"$f":"UPPER('BASE TEC-Tec'!B342)","v":"VISITEURS"}]
[null,null,{"$f":"'BASE TEC-Tec'!B343","v":"distance moyenne du trajet"},0,{"$f":"IF(E$17*E$18=0,0,'BASE TEC-Tec'!$H343)","v":0},{"$f":"'BASE TEC-Tec'!D343","v":"km aller"},1,0,0,0,0]
[null,null,{"$f":"'BASE TEC-Tec'!B344","v":"disponibilité de transports en commun"},"-",{"$f":"IF(E17*E18=0,\"-\",'BASE TEC-Tec'!D348)","v":"-"},"liste déroulante",1,"-","-","-","-"]
[null,null,{"$f":"'BASE TEC-Tec'!B350","v":"emplacements de voitures électriques"},"-",{"$f":"IF(E17*E18=0,\"-\",'BASE TEC-Tec'!D352)","v":"-"},"liste déroulante",1,"-","-","-","-"]
[null,null,{"$f":"'BASE TEC-Tec'!B356","v":"emplacements pour deux-roues"},"-",{"$f":"IF(E17*E18=0,\"-\",'BASE TEC-Tec'!D359)","v":"-"},"liste déroulante",1,"-","-","-","-"]
[]
[null,"AUTRES SERVICES",null,{"$f":"IF(E$17*E$18=0,0,'BASE TEC-Tec'!R394)","v":0},{"$f":"IF(E$17*E$18=0,0,'BASE TEC-Tec'!S394)","v":0},null,null,0,0,0,0]
[]
[null,{"$f":"UPPER('BASE TEC-Tec'!B369)","v":"RESTAURATION DU MIDI"}]
[null,null,"effectif quotidien le midi",0,{"$f":"IF(E$17*E$18=0,0,'BASE TEC-Tec'!$H369)","v":0},{"$f":"'BASE TEC-Tec'!D369","v":"repas / jour"},null,0,0,0,0]
[]
[null,{"$f":"IF(SUM(D257:D262)>1,\"Erreur : total > 100%\",IF(D262<0,\"Erreur : valeur négative\",\"\"))","v":""},{"$f":"'BASE TEC-Tec'!B370","v":"apportée du domicile"},0,{"$f":"IF(E$17*E$18=0,0,'BASE TEC-Tec'!$H370)","v":0},{"$f":"'BASE TEC-Tec'!D370","v":"% des repas"},1,0,0,0,0]
[null,null,{"$f":"'BASE TEC-Tec'!B371","v":"livrée individuellement"},0,{"$f":"IF(E$17*E$18=0,0,'BASE TEC-Tec'!$H371)","v":0},{"$f":"'BASE TEC-Tec'!D371","v":"% des repas"},1,0,0,0,0]
[null,null,{"$f":"'BASE TEC-Tec'!B372","v":"de proximité à pieds"},0,{"$f":"IF(E$17*E$18=0,0,'BASE TEC-Tec'!$H372)","v":0},{"$f":"'BASE TEC-Tec'!D372","v":"% des repas"},1,0,0,0,0]
[null,null,{"$f":"'BASE TEC-Tec'!B373","v":"aux alentours en voiture"},0,{"$f":"IF(E$17*E$18=0,0,'BASE TEC-Tec'!$H373)","v":0},{"$f":"'BASE TEC-Tec'!D373","v":"% des repas"},1,0,0,0,0]
[null,null,{"$f":"'BASE TEC-Tec'!B374","v":"en cafétéria standard"},0,{"$f":"IF(E$17*E$18=0,0,'BASE TEC-Tec'!$H374)","v":0},{"$f":"'BASE TEC-Tec'!D374","v":"% des repas"},1,0,0,0,0]
[null,null,{"$f":"'BASE TEC-Tec'!B375","v":"en cafétéria bas carbone"},0,{"$f":"IF(E255=0,0,1-SUM(E257:E261))","v":0},{"$f":"'BASE TEC-Tec'!D375","v":"% des repas"},1,0,0,0,0]
[]
[null,{"$f":"UPPER('BASE TEC-Tec'!B376)","v":"ACTIVITÉ COMMERCIALE"}]
[null,null,{"$f":"'BASE TEC-Tec'!B377","v":"surface de vente alimentaire"},0,{"$f":"'BASE TEC-Tec'!F377","v":0},{"$f":"'BASE TEC-Tec'!D377","v":"m²"},1,0,0,0,0]
[null,null,{"$f":"'BASE TEC-Tec'!B378","v":"surface de vente non alimentaire"},0,{"$f":"'BASE TEC-Tec'!F378","v":0},{"$f":"'BASE TEC-Tec'!D378","v":"m²"},1,0,0,0,0]
[]
[null,{"$f":"UPPER('BASE TEC-Tec'!B379)","v":"ADDUCTION D'EAU"}]
[null,null,{"$f":"'BASE TEC-Tec'!B380","v":"consommation annuelle eau de réseau"},0,{"$f":"IF(E18=0,\"0\",CONCATENATE(\"estimée à \",ROUND('BASE TEC-Tec'!$H380/100,0)*100))","v":"0"},{"$f":"'BASE TEC-Tec'!D380","v":"m³ / an"},1,0,0,0,0]
[null,null,{"$f":"'BASE TEC-Tec'!B381","v":"récupération et réutilisation d'eau pluviale"},"-",{"$f":"IF(E17*E18=0,\"-\",'BASE TEC-Tec'!D383)","v":"-"},null,1,"-","-","-","-"]
[]
[null,{"$f":"UPPER('BASE TEC-Tec'!B386)","v":"TRAITEMENT DES DÉCHETS"}]
[null,null,{"$f":"'BASE TEC-Tec'!B387","v":"production annuelle"},0,{"$f":"IF(E18=0,\"0\",CONCATENATE(\"estimée à \",ROUND('BASE TEC-Tec'!$H387/10,0)*10))","v":"0"},{"$f":"'BASE TEC-Tec'!D387","v":"tonnes / an"},1,0,0,0,0]
[null,null,{"$f":"'BASE TEC-Tec'!B388","v":"tri sélectif"},"-",{"$f":"IF(E17*E18=0,\"-\",'BASE TEC-Tec'!D391)","v":"-"},null,1,"-","-","-","-"]
[]
[null,"SYNTHESE CARBONE",null,{"$f":"D13","v":0},null,null,null,{"$f":"H13","v":0},{"$f":"I13","v":0},{"$f":"J13","v":0},{"$f":"K13","v":0},"Commentaires"]
[null,null,null,{"$f":"D15","v":"Projet "},null,null,{"$f":"+D277","v":"Projet "},{"$f":"H15","v":"Variante A"},{"$f":"I15","v":"Variante B"},{"$f":"J15","v":"Variante C"},{"$f":"K15","v":"Variante D"}]
[null,"Émissions totales","Construction",{"$f":"'BASE TEC-Tec'!L130+'BASE TEC-Tec'!L131","v":0},null,null,{"$f":"+D278","v":0},0,0,0,0]
[null,null,null,{"$f":"D$277","v":"Projet "},null,null,{"$f":"G$277","v":"Projet "},{"$f":"H$277","v":"Variante A"},{"$f":"I$277","v":"Variante B"},{"$f":"J$277","v":"Variante C"},{"$f":"K$277","v":"Variante D"}]
[null,null,"Énergie",{"$f":"'BASE TEC-Tec'!L296","v":0},null,null,{"$f":"+D280","v":0},0,0,0,0]
[null,null,"Déplacements",{"$f":"'BASE TEC-Tec'!L366","v":0},null,null,0,0,0,0,0]
[null,null,"Autres services",{"$f":"'BASE TEC-Tec'!L393","v":0},null,null,0,0,0,0,0]
[null,null,null,null,null,null,{"$f":"+SUM(G280:G282)","v":0},{"$f":"+SUM(H280:H282)","v":0},{"$f":"+SUM(I280:I282)","v":0},{"$f":"+SUM(J280:J282)","v":0},{"$f":"+SUM(K280:K282)","v":0}]
[null,"Émissions unitaires",{"$f":"C278","v":"Construction"},{"$f":"IF(D$17=0,0,D278/D$17*1000)","v":0},null,null,0,{"$f":"IF(H$17=0,0,H278/H$17*1000)","v":0},{"$f":"IF(I$17=0,0,I278/I$17*1000)","v":0},{"$f":"IF(J$17=0,0,J278/J$17*1000)","v":0},{"$f":"IF(K$17=0,0,K278/K$17*1000)","v":0}]
[null,null,null,{"$f":"D$277","v":"Projet "},null,null,{"$f":"G$277","v":"Projet "},{"$f":"H$277","v":"Variante A"},{"$f":"I$277","v":"Variante B"},{"$f":"J$277","v":"Variante C"},{"$f":"K$277","v":"Variante D"}]
[null,null,{"$f":"C280","v":"Énergie"},{"$f":"IF(D$17=0,0,D280/D$17*1000)","v":0},null,null,0,{"$f":"IF(H$17=0,0,H280/H$17*1000)","v":0},0,{"$f":"IF(J$17=0,0,J280/J$17*1000)","v":0},{"$f":"IF(K$17=0,0,K280/K$17*1000)","v":0}]
[null,null,{"$f":"C281","v":"Déplacements"},{"$f":"IF(D$17=0,0,D281/D$17*1000)","v":0},null,null,0,{"$f":"IF(H$17=0,0,H281/H$17*1000)","v":0},0,0,{"$f":"IF(K$17=0,0,K281/K$17*1000)","v":0}]
[null,null,{"$f":"C282","v":"Autres services"},{"$f":"IF(D$17=0,0,D282/D$17*1000)","v":0},null,null,0,0,0,0,{"$f":"IF(K$17=0,0,K282/K$17*1000)","v":0}]
[null,null,null,null,null,null,{"$f":"+SUM(G286:G288)","v":0},{"$f":"+SUM(H286:H288)","v":0},0,0,{"$f":"+SUM(K286:K288)","v":0}]
[]
[]
[]
[]
[]
[]
[]
[]
[]
[]
[]
[]
[]
[]
[]
[]
[]
[]
[]
[]
[]
[]
[null,null,"Émissions cumulées",{"$f":"D277","v":"Projet "},null,null,null,{"$f":"H277","v":"Variante A"},{"$f":"I277","v":"Variante B"},{"$f":"J277","v":"Variante C"},{"$f":"K277","v":"Variante D"}]
[null,null,"an 0",0,null,null,null,0,0,0,0]
[null,null,"an 1",{"$f":"D278","v":0},null,null,null,{"$f":"H278","v":0},{"$f":"I278","v":0},{"$f":"J278","v":0},{"$f":"K278","v":0}]
[null,null,"an 2",{"$f":"D314+SUM(D$280:D$282)","v":0},null,null,null,{"$f":"H314+SUM(H$280:H$282)","v":0},{"$f":"I314+SUM(I$280:I$282)","v":0},{"$f":"J314+SUM(J$280:J$282)","v":0},0]
[null,null,"an 3",0,null,null,null,0,0,0,0]
[null,null,"an 4",0,null,null,null,0,0,0,0]
[null,null,"an 5",0,null,null,null,0,0,0,0]
[null,null,"an 6",0,null,null,null,0,0,0,0]
[null,null,"an 7",0,null,null,null,0,0,0,0]
[null,null,"an 8",0,null,null,null,0,0,0,0]
[null,null,"an 9",0,null,null,null,0,0,0,0]
[null,null,"an 10",0,null,null,null,0,0,0,0]
[null,null,"an 11",0,null,null,null,0,0,0,0]
[null,null,"an 12",0,null,null,null,0,0,0,0]
[null,null,"an 13",0,null,null,null,0,0,0,0]
[null,null,"an 14",0,null,null,null,0,0,0,0]
[null,null,"an 15",0,null,null,null,0,0,0,0]

{"sheet":"BASE TEC-Tec","index":1,"n_rows":514,"n_cols":20,"rows_kept":514,"cut":false,"hidden":true,"merged":[[1,11,1,14],[1,15,1,16],[1,17,1,18],[397,5,397,7],[1,0,2,0],[1,1,2,1],[1,2,2,2],[1,3,1,8],[1,9,1,10]]}
["TEC-Tec carbone"]
["Poste","Item","n°","Quantités",null,null,null,null,null,"Facteur d'émission",null,"Émissions de GES (tCO2e ou tCO2e/an)",null,null,null,"Pondération",null,"Notation"]
[null,null,null,"Unité",{"$f":"'USER TEC-Tec'!C3","v":"Projet "},"Par défaut","favorable","défaut","défavorable","Unité","Valeur",{"$f":"E3","v":"Projet "},{"$f":"G3","v":"favorable"},{"$f":"H3","v":"défaut"},{"$f":"I3","v":"défavorable"},"théorique","retenue",{"$f":"L3","v":"Projet "},{"$f":"H3","v":"défaut"},"Source FE"]
["Données générales"]
[null,"type de bâtiment",null,"liste",{"$f":"'USER TEC-Tec'!D16","v":"-"},{"$f":"'USER TEC-Tec'!E16","v":"-"}]
[null,"surface utile","SU","m² utile",{"$f":"'USER TEC-Tec'!D17","v":0},{"$f":"'USER TEC-Tec'!E17","v":0},{"$f":"$E6","v":0},0,0]
[null,"surface de la parcelle","SF","m² de foncier",{"$f":"'USER TEC-Tec'!D18","v":0},{"$f":"'USER TEC-Tec'!E18","v":0},0,0,0]
[null,"Jardins","SEV","m²",{"$f":"'USER TEC-Tec'!D20","v":0},{"$f":"H8","v":0},{"$f":"G7*0.9-G15","v":0},{"$f":"(G8+2*I8)/3","v":0},0]
[null,"Parking extérieur véhicules","SPk","m²",{"$f":"'USER TEC-Tec'!D21","v":0},0,{"$f":"G7*0.05","v":0},0,{"$f":"(I7-I8-I15)*0.8","v":0}]
[null,"Cheminement extérieur piéton","SCP","m²",{"$f":"'USER TEC-Tec'!D22","v":0},0,{"$f":"G7*0.05","v":0},0,{"$f":"I9/4","v":0}]
[null,"Planchers (hors sous-sols)","SdP","m²",{"$f":"'USER TEC-Tec'!D23","v":0},0,{"$f":"G12+G6","v":0},0,{"$f":"I12+I6*1.3","v":0}]
[null,"Sous-sols","SSL","m²",{"$f":"'USER TEC-Tec'!D24","v":0},0,0,0,{"$f":"I6/2","v":0}]
[null,"Façades","SFa","m²",{"$f":"'USER TEC-Tec'!D25","v":0},0,{"$f":"G6*0.7","v":0},0,{"$f":"I6*1.5","v":0}]
[null,"Coursives extérieures","SC","m²",{"$f":"'USER TEC-Tec'!D26","v":0},0,{"$f":"G6*0.3","v":0},0,0]
[null,"Toitures","ST","m²",{"$f":"'USER TEC-Tec'!D27","v":0},0,{"$f":"MIN(G7*0.3,G6)","v":0},0,{"$f":"MIN(I6,I7)","v":0}]
[null,"Rapport SU/SdP",null,"[-]",{"$f":"'USER TEC-Tec'!D29","v":0},{"$f":"F6/F11","v":{"$error":"#DIV/0!"}},{"$f":"G6/G11","v":{"$error":"#DIV/0!"}},{"$f":"H6/H11","v":{"$error":"#DIV/0!"}},{"$f":"I6/I11","v":{"$error":"#DIV/0!"}}]
[null,"Indice de compacité",null,"[-]",{"$f":"'USER TEC-Tec'!D30","v":0},{"$f":"H17","v":{"$error":"#DIV/0!"}},{"$f":"G13/G11","v":{"$error":"#DIV/0!"}},{"$f":"H13/H11","v":{"$error":"#DIV/0!"}},{"$f":"I13/I11","v":{"$error":"#DIV/0!"}}]
["Construction",null,null,null,null,null,null,null,null,null,null,null,null,null,null,25,null,null,null,"hyp d'amortissement relatif / usages"]
[null,"Conception",1,null,null,null,null,null,null,null,null,{"$f":"SUM(L20:L21)","v":0},{"$f":"SUM(M20:M21)","v":0},{"$f":"SUM(N20:N21)","v":0},{"$f":"SUM(O20:O21)","v":0},{"$f":"(O19-M19)/$E$6*200/$P$18","v":{"$error":"#DIV/0!"}},0.3,{"$f":"IF(L19=0,Q19,IF(L19>O19,0,IF(L19<M19,Q19,(1-(L19-$M19)/($O19-$M19))*$Q19)))","v":0.3},{"$f":"(1-(N19-$M19)/($O19-$M19))*$Q19","v":{"$error":"#DIV/0!"}}]
[null,"trajets entre La Réunion et la métropole",null,{"$f":"IF(E20>=2,\"allers-retours\",\"aller-retour\")","v":"aller-retour"},{"$f":"'USER TEC-Tec'!D35","v":0},{"$f":"IF(F6*F7=0,0,H20)","v":0},0,{"$f":"ROUND((G20+2*I20)/3,0)","v":0},{"$f":"2*I6/1000","v":0},"kg CO2e / ARM",4000,{"$f":"E20*$K20*'USER TEC-Tec'!G35/1000","v":0},{"$f":"G20*$K20/1000","v":0},{"$f":"H20*$K20/1000","v":0},{"$f":"I20*$K20/1000","v":0},null,null,null,null,"BC V8.1 arrondi"]
[null,"autres",null,"kg CO2e",null,null,null,null,null,null,null,{"$f":"E11*0.03","v":0},{"$f":"G11*0.03","v":0},{"$f":"H11*0.03","v":0},{"$f":"I11*0.03","v":0}]
[null,"Changement d'affectation des sols",2,null,null,null,null,null,null,null,null,{"$f":"L23","v":0},{"$f":"M23","v":0},{"$f":"N23","v":0},{"$f":"O23","v":0},{"$f":"(O22-M22)/$E$6*200/$P$18","v":{"$error":"#DIV/0!"}},0.5,{"$f":"IF(L22>O22,0,IF(L22<M22,Q22,(1-(L22-$M22)/($O22-$M22))*$Q22))","v":{"$error":"#DIV/0!"}},{"$f":"(1-(N22-$M22)/($O22-$M22))*$Q22","v":{"$error":"#DIV/0!"}}]
[null,"artificialisation nette",null,"m²",{"$f":"'USER TEC-Tec'!D38","v":0},{"$f":"IF(F6*F7=0,0,H23)","v":0},{"$f":"-G7/2","v":0},{"$f":"(G23+2*I23)/3","v":0},{"$f":"I7","v":0},"kgCO2e / m²",20,{"$f":"E23*$K23*'USER TEC-Tec'!G38/1000","v":0},{"$f":"G23*$K23/1000","v":0},{"$f":"H23*$K23/1000","v":0},{"$f":"I23*$K23/1000","v":0}]
[null,"Voirie et traitement paysager",3,null,null,null,null,null,null,null,null,{"$f":"SUM(L25:L34)","v":0},{"$f":"SUM(M25:M34)","v":0},{"$f":"SUM(N25:N34)","v":0},{"$f":"SUM(O25:O34)","v":0},{"$f":"(O24-M24)/$E$6*200/$P$18","v":{"$error":"#DIV/0!"}},0.7,{"$f":"IF(SUM(L25:L33)=0,0,IF(L24>O24,0,IF(L24<M24,Q24,(1-(L24-$M24)/($O24-$M24))*$Q24)))","v":0},{"$f":"(1-(N24-$M24)/($O24-$M24))*$Q24","v":{"$error":"#DIV/0!"}}]
[null,"végétalisation (toiture végétalisée inclue)",null,"SEV",{"$f":"E8","v":0},{"$f":"IF(F6*F7=0,0,H25)","v":0},{"$f":"G8","v":0},{"$f":"(G25+2*I25)/3","v":0},{"$f":"I8","v":0},"kgCO2e / m²",-10,{"$f":"E25*$K25*'USER TEC-Tec'!G41/1000","v":0},{"$f":"G25*$K25/1000","v":0},{"$f":"H25*$K25/1000","v":0},{"$f":"I25*$K25/1000","v":0},null,null,null,null,"hyp. masse de plantes"]
[null,"enrobé neuf",null,"% SPk",{"$f":"'USER TEC-Tec'!D43","v":0},{"$f":"IF(F6*F7=0,0,H26)","v":0},0,0,0,"kgCO2e / m²",60,{"$f":"E26*E$9*$K26*'USER TEC-Tec'!G43/1000","v":0},{"$f":"G26*G$9*$K26/1000","v":0},0,0,null,null,null,null,"ép. 6 cm sur plateforme en grave non traitée et grave bitume"]
[null,"dallage en béton",null,"% SPk",{"$f":"'USER TEC-Tec'!D44","v":0},{"$f":"IF(F6*F7=0,0,H27)","v":0},0,0.66666666666666663,1,"kgCO2e / m²",60,{"$f":"E27*E$9*$K27*'USER TEC-Tec'!G44/1000","v":0},0,0,0,null,null,null,null,"ép. 15 cm sur plateforme en grave non traitée"]
[null,"pavage béton enherbé",null,"% SPk",{"$f":"'USER TEC-Tec'!D45","v":0},{"$f":"IF(F6*F7=0,0,H28)","v":0},1,0.33333333333333331,0,"kgCO2e / m²",{"$f":"30-5","v":25},{"$f":"E28*E$9*$K28*'USER TEC-Tec'!G45/1000","v":0},0,0,0,null,null,null,null,"pavé béton et végétalisation"]
[null,"enrobé neuf",null,"% de SCP",{"$f":"'USER TEC-Tec'!D47","v":0},{"$f":"IF(F6*F7=0,0,H29)","v":0},0,0,0,"kgCO2e / m²",40,{"$f":"E29*E$10*$K29*'USER TEC-Tec'!G47/1000","v":0},{"$f":"G29*G$10*$K29/1000","v":0},0,0,null,null,null,null,"ép. 6 cm sur plateforme en grave non traitée"]
[null,"dallage en béton",null,"% de SCP",{"$f":"'USER TEC-Tec'!D48","v":0},{"$f":"IF(F6*F7=0,0,H30)","v":0},0,0.66666666666666663,1,"kgCO2e / m²",50,{"$f":"E30*E$10*$K30*'USER TEC-Tec'!G48/1000","v":0},0,0,0,null,null,null,null,"ép. 12 cm sur plateforme en grave non traitée"]
[null,"matériau perméable",null,"% de SCP",{"$f":"'USER TEC-Tec'!D49","v":0},{"$f":"IF(F6*F7=0,0,H31)","v":0},1,0.33333333333333331,0,"kgCO2e / m²",20,{"$f":"E31*E$10*$K31*'USER TEC-Tec'!G49/1000","v":0},0,0,0,null,null,null,null,"grave non traitée sur plateforme"]
[null,"murets maçonnés",null,"m²",{"$f":"'USER TEC-Tec'!D51","v":0},{"$f":"H32","v":0},0,0,{"$f":"I6/10","v":0},"kgCO2e / m²",200,{"$f":"E32*$K32*'USER TEC-Tec'!G51/1000","v":0},{"$f":"G32*$K32/1000","v":0},0,0,null,null,null,null,"ép. 30 cm pour partie encastré"]
[null,"mur de soutènement",null,"m²",{"$f":"'USER TEC-Tec'!D52","v":0},{"$f":"H33","v":0},0,0,{"$f":"I6/10","v":0},"kgCO2e / m²",40,{"$f":"E33*$K33*'USER TEC-Tec'!G52/1000","v":0},0,0,0]
[null,"autres",null,"kg CO2e",null,null,null,null,null,null,null,{"$f":"E6*0.03","v":0},{"$f":"G6*0.03","v":0},{"$f":"H6*0.03","v":0},{"$f":"I6*0.03","v":0}]
[null,"taux d'imperméabilisation",null,"% de SF",{"$f":"((E26+E27)*E9+E15)/E7","v":{"$error":"#DIV/0!"}},{"$f":"H35","v":0.66666666666666663},0,{"$f":"(G35+2*I35)/3","v":0.66666666666666663},1,"pour information"]
[null,"Fondations",4,null,null,null,null,null,null,null,null,{"$f":"SUM(L37:L47)","v":0},{"$f":"SUM(M37:M47)","v":0},{"$f":"SUM(N37:N47)","v":{"$error":"#VALUE!"}},{"$f":"SUM(O37:O47)","v":0},{"$f":"(O36-M36)/$E$6*200/$P$18","v":{"$error":"#DIV/0!"}},0.8,{"$f":"IF(L36=0,0,IF(L36>O36,0,IF(L36<M36,Q36,(1-(L36-$M36)/($O36-$M36))*$Q36)))","v":0},{"$f":"(1-(N36-$M36)/($O36-$M36))*$Q36","v":{"$error":"#VALUE!"}}]
[null,"terrassements généraux",null,"m³",{"$f":"E12*3","v":0},{"$f":"H37","v":0},{"$f":"G12*3","v":0},{"$f":"H12*3","v":0},{"$f":"I12*3","v":0},"kg CO2e / m³",10,{"$f":"E37*$K37/1000","v":0},{"$f":"G37*$K37/1000","v":0},{"$f":"H37*$K37/1000","v":0},{"$f":"I37*$K37/1000","v":0},null,null,null,null,"prof. de 3 m par niveau de sous-sol"]
[null,"nivellement dans la roche",null,"m³",{"$f":"E15*E39","v":{"$error":"#VALUE!"}},{"$f":"F15*F39","v":{"$error":"#VALUE!"}},{"$f":"G15*G39","v":0},{"$f":"H15*H39","v":{"$error":"#VALUE!"}},{"$f":"I15*I39","v":0},"kg CO2e / m³",10,{"$f":"IF(E39=\"aucun des 3\",\"\",E38*$K38*'USER TEC-Tec'!G55*E39/1000)","v":""},{"$f":"G38*$K38*G39/1000","v":0},{"$f":"H38*$K38*H39/1000","v":{"$error":"#VALUE!"}},{"$f":"I38*$K38*I39/1000","v":0},null,null,null,null,"en plus des terrassements généraux"]
[null,null,null,{"$f":"'USER TEC-Tec'!D55","v":0},{"$f":"IF(D39=D41,E41,IF(D39=D42,E42,IF(D39=D43,E43,\"aucun des 3\")))","v":"aucun des 3"},{"$f":"IF('USER TEC-Tec'!E55=D41,F41,IF('USER TEC-Tec'!E55=D42,F42,IF('USER TEC-Tec'!E55=D43,F43,\"aucun des 3\")))","v":"aucun des 3"},{"$f":"MIN(E41:E43)","v":0},{"$f":"F39","v":"aucun des 3"},{"$f":"MAX(E41:E43)","v":2}]
[null,null,null,"-"]
[null,null,null,"sans ",0,{"$f":"E41","v":0}]
[null,null,null,"moins d'un mètre",{"$f":"2/3","v":0.66666666666666663},{"$f":"E42","v":0.66666666666666663}]
[null,null,null,"environ deux mètres",2,{"$f":"E43","v":2}]
[null,"pieux béton",null,"% de SU",{"$f":"'USER TEC-Tec'!D57","v":0},{"$f":"IF(F6*F7=0,0,H44)","v":0},0,{"$f":"(G44+2*I44)/3","v":0},0,"kgCO2e / m²",{"$f":"1.2*30","v":36},{"$f":"E44*E$6*$K44*'USER TEC-Tec'!G55/1000","v":0},{"$f":"G44*G$6*$K44/1000","v":0},0,0,null,null,null,null,"ép. moy. 5 à 10 cm"]
[null,"micropieux",null,"% de SU",{"$f":"'USER TEC-Tec'!D58","v":0},{"$f":"IF(F6*F7=0,0,H45)","v":0},0,{"$f":"(G45+2*I45)/3","v":0},0,"kgCO2e / m²",{"$f":"1.2*20","v":24},{"$f":"E45*E$6*$K45*'USER TEC-Tec'!G57/1000","v":0},0,0,0,null,null,null,null,"lg moy. 10 cm + ép. moy. 1 cm"]
[null,"radier",null,"% de SU",{"$f":"'USER TEC-Tec'!D59","v":0},{"$f":"IF(F6*F7=0,0,H46)","v":0},0,{"$f":"(G46+2*I46)/3","v":0.66666666666666663},1,"kgCO2e / m²",{"$f":"1.2*50","v":60},{"$f":"E46*E$6*$K46*'USER TEC-Tec'!G59/1000","v":0},0,0,0,null,null,null,null,"ép. moy. 10 cm"]
[null,"superficielles",null,"% de SU",{"$f":"'USER TEC-Tec'!D60","v":0},{"$f":"IF(F6*F7=0,0,H47)","v":0},1,{"$f":"(G47+2*I47)/3","v":0.33333333333333331},0,"kgCO2e / m²",{"$f":"1.2*15","v":18},{"$f":"E47*E$6*$K47*'USER TEC-Tec'!G60/1000","v":0},0,0,0,null,null,null,null,"ép. moy. 3 à 4 cm"]
[null,"Infrastructure",5,null,null,null,null,null,null,null,null,{"$f":"SUM(L49:L50)","v":0},{"$f":"SUM(M49:M50)","v":0},{"$f":"SUM(N49:N50)","v":0},{"$f":"SUM(O49:O50)","v":0},{"$f":"(O48-M48)/$E$6*200/$P$18","v":{"$error":"#DIV/0!"}},0.7,{"$f":"IF(L48>O48,0,IF(L48<M48,Q48,(1-(L48-$M48)/($O48-$M48))*$Q48))","v":{"$error":"#DIV/0!"}},{"$f":"(1-(N48-$M48)/($O48-$M48))*$Q48","v":{"$error":"#DIV/0!"}}]
[null,"sous-sols",null,"SSL",{"$f":"'USER TEC-Tec'!D63","v":0},{"$f":"H49","v":0},{"$f":"G12","v":0},{"$f":"(G49+2*I49)/3","v":0},{"$f":"I12","v":0},"kgCO2e / m²",{"$f":"480*0.3","v":144},{"$f":"E49*$K49*'USER TEC-Tec'!G63/1000","v":0},{"$f":"G49*$K49/1000","v":0},0,0,null,null,null,null,"ép. moy. 30 cm"]
[null,"plus-value poutres de reprise",null,"m²",{"$f":"'USER TEC-Tec'!D64","v":0},{"$f":"H50","v":0},0,{"$f":"(G50+2*I50)/3","v":0},{"$f":"I49/2","v":0},"kgCO2e / m²",{"$f":"700*0.05","v":35},{"$f":"E50*$K50*'USER TEC-Tec'!G64/1000","v":0},0,0,0,null,null,null,null,"ép. moy. 5 cm supplémentaires"]
[null,"Planchers",6,null,null,null,null,null,null,null,null,{"$f":"SUM(L52:L56)","v":0},{"$f":"SUM(M52:M56)","v":0},{"$f":"SUM(N52:N56)","v":0},{"$f":"SUM(O52:O56)","v":0},{"$f":"(O51-M51)/$E$6*200/$P$18","v":{"$error":"#DIV/0!"}},1.5,{"$f":"IF(L51=0,0,IF(L51>O51,0,IF(L51<M51,Q51,(1-(L51-$M51)/($O51-$M51))*$Q51)))","v":0},{"$f":"(1-(N51-$M51)/($O51-$M51))*$Q51","v":{"$error":"#DIV/0!"}}]
[null,"béton",null,"% de (SdP + SC)",{"$f":"'USER TEC-Tec'!D67","v":0},{"$f":"IF(F6*F7=0,0,H52)","v":0},0.1,{"$f":"(G52+2*I52)/3","v":0.70000000000000007},1,"kgCO2e / m²",{"$f":"450*0.2","v":90},{"$f":"E52*(E$11+E$14)*$K52*'USER TEC-Tec'!G67/1000","v":0},{"$f":"G52*(G$11+G$14)*$K52/1000","v":0},0,0,null,null,null,null,"ép. moy. 20 cm"]
[null,"collaborant métal-béton",null,"% de (SdP + SC)",{"$f":"'USER TEC-Tec'!D68","v":0},{"$f":"IF(F6*F7=0,0,H53)","v":0},0,{"$f":"(G53+2*I53)/3","v":0},0,"kgCO2e / m²",{"$f":"1800*0.04+400*0.12","v":120},{"$f":"E53*(E$11+E$14)*$K53*'USER TEC-Tec'!G68/1000","v":0},0,0,0,null,null,null,null,"acier 40 kg/m² et béton ép. 12 cm"]
[null,"collaborant bois-béton",null,"% de (SdP + SC)",{"$f":"'USER TEC-Tec'!D69","v":0},{"$f":"IF(F6*F7=0,0,H54)","v":0},0.3,{"$f":"(G54+2*I54)/3","v":9.9999999999999992E-2},0,"kgCO2e / m²",0,{"$f":"E54*(E$11+E$14)*$K54*'USER TEC-Tec'!G69/1000","v":0},0,0,0,null,null,null,null,"bois 25 kg/m² et chape ép. 5 cm"]
[null,"ossature et platelage bois",null,"% de (SdP + SC)",{"$f":"'USER TEC-Tec'!D70","v":0},{"$f":"IF(F6*F7=0,0,H55)","v":0},0.3,{"$f":"(G55+2*I55)/3","v":9.9999999999999992E-2},0,"kgCO2e / m²",{"$f":"-20","v":-20},{"$f":"E55*(E$11+E$14)*$K55*'USER TEC-Tec'!G70/1000","v":0},0,0,0,null,null,null,null,"bois 25 kg/m² et parquet bois"]
[null,"bois plein (CLT)",null,"% de (SdP + SC)",{"$f":"'USER TEC-Tec'!D71","v":0},{"$f":"IF(F6*F7=0,0,H56)","v":0},0.3,{"$f":"(G56+2*I56)/3","v":9.9999999999999992E-2},0,"kgCO2e / m²",{"$f":"-80","v":-80},{"$f":"E56*(E$11+E$14)*$K56*'USER TEC-Tec'!G71/1000","v":0},0,0,0,null,null,null,null,"bois CLT masse moy. 110 kg/m²"]
[null,"Ossature principale",7,null,null,null,null,null,null,null,null,{"$f":"SUM(L58:L63)","v":0},{"$f":"SUM(M58:M63)","v":0},{"$f":"SUM(N58:N63)","v":0},{"$f":"SUM(O58:O63)","v":0},{"$f":"(O57-M57)/$E$6*200/$P$18","v":{"$error":"#DIV/0!"}},1,{"$f":"IF(L57=0,0,IF(L57>O57,0,IF(L57<M57,Q57,(1-(L57-$M57)/($O57-$M57))*$Q57)))","v":0},{"$f":"(1-(N57-$M57)/($O57-$M57))*$Q57","v":{"$error":"#DIV/0!"}}]
[null,"voiles de refend en béton",null,"% de SdP",{"$f":"'USER TEC-Tec'!D74","v":0},{"$f":"IF(F6*F7=0,0,H58)","v":0},0,{"$f":"(G58+2*I58)/3","v":0.33333333333333331},0.5,"kgCO2e / m²",{"$f":"420*0.17","v":71.400000000000006},{"$f":"E58*E$11*$K58*'USER TEC-Tec'!G74/1000","v":0},{"$f":"G58*G$11*$K58/1000","v":0},0,0,null,null,null,null,"hyp. de 1 m² par m² avec ép. 17 cm"]
[null,"murs en matériaux locaux",null,"% de SdP",{"$f":"'USER TEC-Tec'!D75","v":0},{"$f":"IF(F6*F7=0,0,H59)","v":0},0,0,0,"kgCO2e / m²",{"$f":"15","v":15},{"$f":"E59*E$11*$K59*'USER TEC-Tec'!G75/1000","v":0},0,0,0,null,null,null,null,"hyp remplissage pierre ou terre crue"]
[null,"ossature béton",null,"% de SdP",{"$f":"'USER TEC-Tec'!D76","v":0},{"$f":"IF(F6*F7=0,0,H60)","v":0},0,0,0,"kgCO2e / m²",{"$f":"700*0.03","v":21},{"$f":"E60*E$11*$K60*'USER TEC-Tec'!G76/1000","v":0},0,0,0,null,null,null,null,"ép. moy. 3 cm"]
[null,"ossature métal",null,"% de SdP",{"$f":"'USER TEC-Tec'!D77","v":0},{"$f":"IF(F6*F7=0,0,H61)","v":0},0,0.33333333333333331,0.5,"kgCO2e / m²",{"$f":"1800*0.02","v":36},{"$f":"E61*E$11*$K61*'USER TEC-Tec'!G77/1000","v":0},0,0,0,null,null,null,null,"acier 20 kg/m²"]
[null,"ossature bois",null,"% de SdP",{"$f":"'USER TEC-Tec'!D78","v":0},{"$f":"IF(F6*F7=0,0,H62)","v":0},0,0,0,"kgCO2e / m²",{"$f":"-15","v":-15},{"$f":"E62*E$11*$K62*'USER TEC-Tec'!G78/1000","v":0},0,0,0,null,null,null,null,"bois 20 kg/m²"]
[null,"bois massif (CLT)",null,"% de SdP",{"$f":"'USER TEC-Tec'!D79","v":0},{"$f":"IF(F6*F7=0,0,H63)","v":0},1,0.33333333333333331,0,"kgCO2e / m²",{"$f":"-30","v":-30},{"$f":"E63*E$11*$K63*'USER TEC-Tec'!G79/1000","v":0},0,0,0,null,null,null,null,"bois 40 kg/m²"]
[null,"Remplissage de façade",8,null,null,null,null,null,null,null,null,{"$f":"SUM(L65:L74)","v":0},{"$f":"SUM(M65:M74)","v":0},{"$f":"SUM(N65:N74)","v":0},{"$f":"SUM(O65:O74)","v":0},{"$f":"(O64-M64)/$E$6*200/$P$18","v":{"$error":"#DIV/0!"}},0.8,{"$f":"IF(L64=0,0,IF(L64>O64,0,IF(L64<M64,Q64,(1-(L64-$M64)/($O64-$M64))*$Q64)))","v":0},{"$f":"(1-(N64-$M64)/($O64-$M64))*$Q64","v":{"$error":"#DIV/0!"}}]
[null,"voiles béton",null,"% de SFa",{"$f":"'USER TEC-Tec'!D82","v":0},{"$f":"IF(F6*F7=0,0,H65)","v":0},0,{"$f":"(G65+2*I65)/3","v":0.16666666666666666},0.25,"kgCO2e / m²",70,{"$f":"E65*E$13*$K65*'USER TEC-Tec'!G82/1000","v":0},{"$f":"G65*G$13*$K65/1000","v":0},{"$f":"H65*H$13*$K65/1000","v":0},{"$f":"I65*I$13*$K65/1000","v":0},null,null,null,null,"ép. moy. 16 cm"]
[null,"maçonnerie",null,"% de SFa",{"$f":"'USER TEC-Tec'!D83","v":0},{"$f":"IF(F6*F7=0,0,H66)","v":0},0,0,0,"kgCO2e / m²",35,{"$f":"E66*E$13*$K66*'USER TEC-Tec'!G83/1000","v":0},0,0,0,null,null,null,null,"parpaing creux ou brique creuse"]
[null,"métallique",null,"% de SFa",{"$f":"'USER TEC-Tec'!D84","v":0},{"$f":"IF(F6*F7=0,0,H67)","v":0},0.8,0.26666666666666666,0,"kgCO2e / m²",80,{"$f":"E67*E$13*$K67*'USER TEC-Tec'!G84/1000","v":0},0,0,0,null,null,null,null,"bardage double et isolant"]
[null,"mur en terre",null,"% de SFa",{"$f":"'USER TEC-Tec'!D84","v":0},{"$f":"IF(F6*F7=0,0,H68)","v":0},0,0,0,"kgCO2e / m²",5,{"$f":"E68*E$13*$K68*'USER TEC-Tec'!G84/1000","v":0},0,0,0]
[null,"ossature bois",null,"% de SFa",{"$f":"'USER TEC-Tec'!D86","v":0},{"$f":"IF(F6*F7=0,0,H69)","v":0},0,0,0,"kgCO2e / m²",-15,{"$f":"E69*E$13*$K69*'USER TEC-Tec'!G86/1000","v":0},0,0,0,null,null,null,null,"ép. moy. 4 cm (MOB 15 kg/m²)"]
[null,"mur rideau acier et aluminium",null,"% de SFa",{"$f":"'USER TEC-Tec'!D87","v":0},{"$f":"IF(F6*F7=0,0,H70)","v":0},0,0,0,"kgCO2e / m²",130,{"$f":"E70*E$13*$K70*'USER TEC-Tec'!G87/1000","v":0},0,0,0]
[null,"châssis acier vitré",null,"% de SFa",{"$f":"'USER TEC-Tec'!D88","v":0},{"$f":"IF(F6*F7=0,0,H71)","v":0},0,0.16666666666666666,0.25,"kgCO2e / m²",115,{"$f":"E71*E$13*$K71*'USER TEC-Tec'!G88/1000","v":0},0,0,0]
[null,"châssis aluminium vitré",null,"% de SFa",{"$f":"'USER TEC-Tec'!D89","v":0},{"$f":"IF(F6*F7=0,0,H72)","v":0},0,0.33333333333333331,0.5,"kgCO2e / m²",105,{"$f":"E72*E$13*$K72*'USER TEC-Tec'!G89/1000","v":0},0,0,0]
[null,"châssis PVC vitré",null,"% de SFa",{"$f":"'USER TEC-Tec'!D90","v":0},{"$f":"IF(F6*F7=0,0,H73)","v":0},0,0,0,"kgCO2e / m²",85,{"$f":"E73*E$13*$K73*'USER TEC-Tec'!G90/1000","v":0},0,0,0]
[null,"châssis bois vitré",null,"% de SFa",{"$f":"'USER TEC-Tec'!D91","v":0},{"$f":"IF(F6*F7=0,0,H74)","v":0},0.2,6.6666666666666666E-2,0,"kgCO2e / m²",40,{"$f":"E74*E$13*$K74*'USER TEC-Tec'!G91/1000","v":0},0,0,0]
[null,"Revêtement de façade",9,null,null,null,null,null,null,null,null,{"$f":"SUM(L76:L82)","v":0},{"$f":"SUM(M76:M82)","v":0},{"$f":"SUM(N76:N82)","v":0},{"$f":"SUM(O76:O82)","v":0},{"$f":"(O75-M75)/$E$6*200/$P$18","v":{"$error":"#DIV/0!"}},0.3,{"$f":"IF(L75=0,0,IF(L75>O75,0,IF(L75<M75,Q75,(1-(L75-$M75)/($O75-$M75))*$Q75)))","v":0},{"$f":"(1-(N75-$M75)/($O75-$M75))*$Q75","v":{"$error":"#DIV/0!"}}]
[null,"peinture",null,"% de SFa",{"$f":"'USER TEC-Tec'!D94","v":0},{"$f":"IF($F$6*$F$7=0,0,H76)","v":0},0,{"$f":"(G76+2*I76)/3","v":0},0,"kgCO2e / m²",1,{"$f":"E76*E$13*$K76*'USER TEC-Tec'!G94/1000","v":0},{"$f":"G76*G$13*$K76/1000","v":0},0,0]
[null,"enduit",null,"% de SFa",{"$f":"'USER TEC-Tec'!D95","v":0},0,0,0,0,"kgCO2e / m²",8,{"$f":"E77*E$13*$K77*'USER TEC-Tec'!G95/1000","v":0},0,0,0]
[null,"briquette ou pierre",null,"% de SFa",{"$f":"'USER TEC-Tec'!D96","v":0},0,0,0,0,"kgCO2e / m²",20,{"$f":"E78*E$13*$K78*'USER TEC-Tec'!G96/1000","v":0},0,0,0]
[null,"panneaux minéraux",null,"% de SFa",{"$f":"'USER TEC-Tec'!D97","v":0},0,0,0,0,"kgCO2e / m²",45,{"$f":"E79*E$13*$K79*'USER TEC-Tec'!G97/1000","v":0},0,0,0]
[null,"bardage acier",null,"% de SFa",{"$f":"'USER TEC-Tec'!D98","v":0},0,0,0,0,"kgCO2e / m²",35,{"$f":"E80*E$13*$K80*'USER TEC-Tec'!G98/1000","v":0},0,0,0]
[null,"bardage aluminium",null,"% de SFa",{"$f":"'USER TEC-Tec'!D99","v":0},0,0,0.16666666666666666,0.25,"kgCO2e / m²",80,{"$f":"E81*E$13*$K81*'USER TEC-Tec'!G99/1000","v":0},0,0,0]
[null,"bardage bois",null,"% de SFa",{"$f":"'USER TEC-Tec'!D100","v":0},0,0.8,0.26666666666666666,0,"kgCO2e / m²",0,{"$f":"E82*E$13*$K82*'USER TEC-Tec'!G100/1000","v":0},0,0,0]
[null,"Protections solaires extérieures",null,null,null,null,null,null,null,null,null,{"$f":"SUM(L84:L93)","v":0},{"$f":"SUM(M84:M93)","v":0},{"$f":"SUM(N84:N93)","v":{"$error":"#VALUE!"}},{"$f":"SUM(O84:O93)","v":0},{"$f":"(O83-M83)/$E$6*200/$P$18","v":{"$error":"#DIV/0!"}},1,{"$f":"IF(L83>O83,0,IF(L83<M83,Q83,(1-(L83-$M83)/($O83-$M83))*$Q83))","v":{"$error":"#DIV/0!"}},{"$f":"(1-(N83-$M83)/($O83-$M83))*$Q83","v":{"$error":"#VALUE!"}}]
[null,"brise-soleil en toile ou en bois",null,"% de SFa",{"$f":"'USER TEC-Tec'!D103","v":0},{"$f":"IF($F$6*$F$7=0,0,H84)","v":0},0.6,{"$f":"(G84+2*I84)/3","v":0.19999999999999998},0,"kgCO2e / m²",0,{"$f":"E84*E$13*$K84*'USER TEC-Tec'!G103/1000","v":0},{"$f":"G84*G$13*$K84/1000","v":0},0,0]
[null,"brise-soleil en aluminium",null,"% de SFa",{"$f":"'USER TEC-Tec'!D104","v":0},{"$f":"IF($F$6*$F$7=0,0,H85)","v":0},0,{"$f":"(G85+2*I85)/3","v":0.39999999999999997},0.6,"kgCO2e / m²",100,{"$f":"E85*E$13*$K85*'USER TEC-Tec'!G104/1000","v":0},0,0,0]
[null,"motorisation des brise-soleil",null,"% de SFa",{"$f":"IF(E87=\"aucun des 2\",\"\",(E84+E85)*E87)","v":""},{"$f":"IF(F87=\"aucun des 2\",\"\",(F84+F85)*F87)","v":""},{"$f":"(G84+G85)*G87","v":0},{"$f":"(H84+H85)*H87","v":{"$error":"#VALUE!"}},{"$f":"(I84+I85)*I87","v":0.6},"kgCO2e / m²",10,{"$f":"IF(E87=\"aucun des 2\",\"\",E86*E$13*$K86*'USER TEC-Tec'!G105/1000)","v":""},0,{"$error":"#VALUE!"},0]
[null,null,null,{"$f":"'USER TEC-Tec'!D105","v":"-"},{"$f":"IF(D87=D89,E89,IF(D87=D90,E90,\"aucun des 2\"))","v":"aucun des 2"},{"$f":"IF('USER TEC-Tec'!E105=D89,F89,IF('USER TEC-Tec'!E105=D90,F90,\"aucun des 2\"))","v":"aucun des 2"},{"$f":"MIN(E89:E90)","v":0},{"$f":"F87","v":"aucun des 2"},{"$f":"MAX(E89:E90)","v":1}]
[null,null,null,"-"]
[null,null,null,"oui",1,{"$f":"E89","v":1}]
[null,null,null,"non",0,{"$f":"E90","v":0}]
[null,"casquette (et/ou joue) bois",null,"% de SFa",{"$f":"'USER TEC-Tec'!D106","v":0},{"$f":"IF($F$6*$F$7=0,0,H91)","v":0},0.6,{"$f":"(G91+2*I91)/3","v":0.19999999999999998},0,"kgCO2e / m²",-10,{"$f":"E91*E$13*$K91*'USER TEC-Tec'!G106/1000","v":0},{"$f":"G91*G$13*$K91/1000","v":0},0,0]
[null,"casquette (et/ou joue) métal",null,"% de SFa",{"$f":"'USER TEC-Tec'!D107","v":0},{"$f":"IF($F$6*$F$7=0,0,H92)","v":0},0,{"$f":"(G92+2*I92)/3","v":0},0,"kgCO2e / m²",30,{"$f":"E92*E$13*$K92*'USER TEC-Tec'!G107/1000","v":0},0,0,0]
[null,"casquette (et/ou joue) béton",null,"% de SFa",{"$f":"'USER TEC-Tec'!D108","v":0},{"$f":"H93","v":0.39999999999999997},0,{"$f":"(G93+2*I93)/3","v":0.39999999999999997},0.6,"kgCO2e / m²",40,{"$f":"E93*E$13*$K93*'USER TEC-Tec'!G108/1000","v":0},0,0,0,null,null,null,null,"ép. moy. 16 cm 1 m de lg / 3 m ht"]
[null,"Toiture",10,null,null,null,null,null,null,null,null,{"$f":"SUM(L95:L101)","v":0},{"$f":"SUM(M95:M101)","v":0},{"$f":"SUM(N95:N101)","v":0},{"$f":"SUM(O95:O101)","v":0},{"$f":"(O94-M94)/$E$6*200/$P$18","v":{"$error":"#DIV/0!"}},1.1000000000000001,{"$f":"IF(L94=0,0,IF(L94>O94,0,IF(L94<M94,Q94,(1-(L94-$M94)/($O94-$M94))*$Q94)))","v":0},{"$f":"(1-(N94-$M94)/($O94-$M94))*$Q94","v":{"$error":"#DIV/0!"}}]
[null,"dalle béton",null,"% de ST",{"$f":"'USER TEC-Tec'!D111","v":0},{"$f":"IF($F$6*$F$7=0,0,H95)","v":0},0,{"$f":"(G95+2*I95)/3","v":0.66666666666666663},1,"kgCO2e / m²",108,{"$f":"E95*E$15*$K95*'USER TEC-Tec'!G111/1000","v":0},{"$f":"G95*G$15*$K95/1000","v":0},0,0]
[null,"plancher bois",null,"% de ST",{"$f":"'USER TEC-Tec'!D112","v":0},0,0,0,0,"kgCO2e / m²",-20,{"$f":"E96*E$15*$K96*'USER TEC-Tec'!G112/1000","v":0},0,0,0]
[null,"charpente métallique",null,"% de ST",{"$f":"'USER TEC-Tec'!D114","v":0},0,0,0,0,"kgCO2e / m²",40,{"$f":"E97*E$15*$K97*'USER TEC-Tec'!G114/1000","v":0},0,0,0]
[null,"charpente bois",null,"% de ST",{"$f":"'USER TEC-Tec'!D115","v":0},0,1,0.33333333333333331,0,"kgCO2e / m²",-20,{"$f":"E98*E$15*$K98*'USER TEC-Tec'!G115/1000","v":0},0,0,0]
[null,"revêtement d'étanchéité",null,"% de ST",{"$f":"'USER TEC-Tec'!D117","v":0},0,0,0.33333333333333331,0.5,"kgCO2e / m²",20,{"$f":"E99*E$15*$K99*'USER TEC-Tec'!G117/1000","v":0},0,0,0]
[null,"couverte en tôle",null,"% de ST",{"$f":"'USER TEC-Tec'!D118","v":0},0,0,0.33333333333333331,0.5,"kgCO2e / m²",20,{"$f":"E100*E$15*$K100*'USER TEC-Tec'!G118/1000","v":0},0,0,0]
[null,"couverture biosourcée",null,"% de ST",{"$f":"'USER TEC-Tec'!D119","v":0},0,1,0.33333333333333331,0,"kgCO2e / m²",-5,{"$f":"E101*E$15*$K101*'USER TEC-Tec'!G119/1000","v":0},0,0,0]
[null,"Isolation",11,null,null,null,null,null,null,null,null,{"$f":"SUM(L103:L110)","v":0},{"$f":"SUM(M103:M110)","v":0},{"$f":"SUM(N103:N110)","v":{"$error":"#VALUE!"}},{"$f":"SUM(O103:O110)","v":0},{"$f":"(O102-M102)/$E$6*200/$P$18","v":{"$error":"#DIV/0!"}},0.3,{"$f":"IF(D104=\"-\",0,IF(L102>O102,0,IF(L102<M102,Q102,(1-(L102-$M102)/($O102-$M102))*$Q102)))","v":0},{"$f":"(1-(N102-$M102)/($O102-$M102))*$Q102","v":{"$error":"#VALUE!"}}]
[null,"toiture",null,"m²",{"$f":"E15","v":0},{"$f":"H103","v":0},{"$f":"G15","v":0},{"$f":"H15","v":0},{"$f":"I15","v":0},"kg CO2e / m³",10,{"$f":"IF(E104=\"aucun des 3\",\"\",E103*$K103*'USER TEC-Tec'!G117*E104/1000)","v":""},{"$f":"G103*$K103*G104/1000","v":0},{"$f":"H103*$K103*H104/1000","v":{"$error":"#VALUE!"}},{"$f":"I103*$K103*I104/1000","v":0}]
[null,null,null,{"$f":"'USER TEC-Tec'!D122","v":"-"},{"$f":"IF(D104=D106,E106,IF(D104=D107,E107,IF(D104=D108,E108,\"aucun des 3\")))","v":"aucun des 3"},{"$f":"IF('USER TEC-Tec'!E122=D106,F106,IF('USER TEC-Tec'!E122=D107,F107,IF('USER TEC-Tec'!E122=D108,F108,\"aucun des 3\")))","v":"aucun des 3"},{"$f":"MIN(E106:E108)","v":-1},{"$f":"F104","v":"aucun des 3"},{"$f":"MAX(E106:E108)","v":1}]
[null,null,null,"-"]
[null,null,null,"sans isolant",0,{"$f":"E106","v":0}]
[null,null,null,"isolant conventionnel",1,{"$f":"E107","v":1}]
[null,null,null,"isolant biosourcé",-1,{"$f":"E108","v":-1}]
[null,"façades avec isolant conventionnel",null,"% de SFa",{"$f":"'USER TEC-Tec'!D123","v":0},{"$f":"IF($F$6*$F$7=0,0,H109)","v":0},0,{"$f":"(G109+2*I109)/3","v":0.26666666666666666},0.4,"kgCO2e / m²",20,{"$f":"E109*E$13*$K109*'USER TEC-Tec'!G123/1000","v":0},{"$f":"G109*G$13*$K109/1000","v":0},0,0]
[null,"façades avec isolant biosourcé",null,"% de SFa",{"$f":"'USER TEC-Tec'!D124","v":0},{"$f":"IF($F$6*$F$7=0,0,H110)","v":0},0.8,{"$f":"(G110+2*I110)/3","v":0.26666666666666666},0,"kgCO2e / m²",-10,{"$f":"E110*E$13*$K110*'USER TEC-Tec'!G124/1000","v":0},0,0,0]
[null,"Habillages intérieurs",12,null,null,null,null,null,null,null,null,{"$f":"SUM(L112:L114)","v":0},{"$f":"SUM(M112:M114)","v":0},{"$f":"SUM(N112:N114)","v":0},{"$f":"SUM(O112:O114)","v":0},{"$f":"(O111-M111)/$E$6*200/$P$18","v":{"$error":"#DIV/0!"}},0.5,{"$f":"IF(L111=0,0,IF(L111>O111,0,IF(L111<M111,Q111,(1-(L111-$M111)/($O111-$M111))*$Q111)))","v":0},{"$f":"(1-(N111-$M111)/($O111-$M111))*$Q111","v":{"$error":"#DIV/0!"}}]
[null,"faux-plafond minéral",null,"% de SU",{"$f":"'USER TEC-Tec'!D127","v":0},{"$f":"IF($F$6*$F$7=0,0,H112)","v":0},0,{"$f":"(G112+2*I112)/3","v":0.66666666666666663},1,"kgCO2e / m²",25,{"$f":"E112*E$6*$K112*'USER TEC-Tec'!G127/1000","v":0},{"$f":"G112*G$6*$K112/1000","v":0},0,0]
[null,"faux-plancher technique",null,"% de SU",{"$f":"'USER TEC-Tec'!D128","v":0},{"$f":"IF($F$6*$F$7=0,0,H113)","v":0},0,{"$f":"(G113+2*I113)/3","v":0.66666666666666663},1,"kgCO2e / m²",40,{"$f":"E113*E$6*$K113*'USER TEC-Tec'!G128/1000","v":0},0,0,0]
[null,"autres",null,"kg CO2e",null,null,null,null,null,null,null,{"$f":"E6*0.075","v":0},{"$f":"G6*0.075","v":0},{"$f":"H6*0.075","v":0},{"$f":"I6*0.075","v":0}]
[null,"Production locale d'EnR",13,null,null,null,null,null,null,"m² PV / kWc",8,{"$f":"SUM(L116:L118)","v":0},{"$f":"SUM(M116:M118)","v":0},{"$f":"SUM(N116:N118)","v":0},{"$f":"SUM(O116:O118)","v":0},{"$f":"(O115-M115)/$E$6*200/$P$18","v":{"$error":"#DIV/0!"}},2.4,{"$f":"IF(L115>O115,0,IF(L115<M115,Q115,(1-(L115-$M115)/($O115-$M115))*$Q115))","v":{"$error":"#DIV/0!"}},{"$f":"(1-(N115-$M115)/($O115-$M115))*$Q115","v":{"$error":"#DIV/0!"}}]
[null,"installation solaire thermique",null,"m² de panneaux",{"$f":"'USER TEC-Tec'!D131","v":0},{"$f":"IF($F$6*$F$7=0,0,H116)","v":0},0,{"$f":"(2*G116+I116)/3","v":0},{"$f":"I6*5/1000","v":0},"kgCO2e / m²",80,{"$f":"E116*$K116*'USER TEC-Tec'!G131/1000","v":0},{"$f":"G116*$K116/1000","v":0},0,0]
[null,"installation photovoltaïque sans batterie",null,"kWc",{"$f":"'USER TEC-Tec'!D132","v":0},{"$f":"IF($F$6*$F$7=0,0,H117)","v":0},0,0,0,"kgCO2e / kWc",{"$f":"250*K115","v":2000},{"$f":"E117*$K117*'USER TEC-Tec'!G132/1000","v":0},0,0,0]
[null,"installation photovoltaïque avec batteries",null,"kWc",{"$f":"'USER TEC-Tec'!D133","v":0},{"$f":"IF($F$6*$F$7=0,0,H118)","v":0},0,0,{"$f":"G6*0.1","v":0},"kgCO2e / kWc",{"$f":"K117*1.5","v":3000},{"$f":"E118*$K118*'USER TEC-Tec'!G133/1000","v":0},0,0,0]
[null,"Variation d'albédo",14,null,null,null,null,null,null,null,null,{"$f":"SUM(L120:L123)","v":0},{"$f":"SUM(M120:M123)","v":0},{"$f":"SUM(N120:N123)","v":0},{"$f":"SUM(O120:O123)","v":0},{"$f":"(O119-M119)/$E$6*200/$P$18","v":{"$error":"#DIV/0!"}},0.8,{"$f":"IF(L119>O119,0,IF(L119<M119,Q119,(1-(L119-$M119)/($O119-$M119))*$Q119))","v":{"$error":"#DIV/0!"}},{"$f":"(1-(N119-$M119)/($O119-$M119))*$Q119","v":{"$error":"#DIV/0!"}}]
[null,"ton presque inchangé",null,"% de SF",{"$f":"'USER TEC-Tec'!D136","v":0},{"$f":"IF($F$6*$F$7=0,0,H120)","v":0},0.5,{"$f":"(G120+2*I120)/3","v":0.5},0.5,"kgCO2e / m²",0,{"$f":"E120*E$7*$K120*'USER TEC-Tec'!G136/1000","v":0},{"$f":"G120*G$7*$K120/1000","v":0},0,0]
[null,"fonçage (couleur foncée → noir)",null,"% de SF",{"$f":"'USER TEC-Tec'!D137","v":0},{"$f":"IF($F$6*$F$7=0,0,H121)","v":0},0,{"$f":"(G121+2*I121)/3","v":0.33333333333333331},0.5,"kgCO2e / m²",{"$f":"320*0.1","v":32},{"$f":"E121*E$7*$K121*'USER TEC-Tec'!G137/1000","v":0},0,0,0]
[null,"éclaircissement (couleur foncée → couleur moyenne)",null,"% de SF",{"$f":"'USER TEC-Tec'!D138","v":0},{"$f":"IF($F$6*$F$7=0,0,H122)","v":0},0.25,{"$f":"(G122+2*I122)/3","v":8.3333333333333329E-2},0,"kgCO2e / m²",{"$f":"-320*0.15","v":-48},{"$f":"E122*E$7*$K122*'USER TEC-Tec'!G138/1000","v":0},0,0,0]
[null,"fort éclaircissement (couleur foncée → couleur très claire)",null,"% de SF",{"$f":"'USER TEC-Tec'!D139","v":0},{"$f":"IF($F$6*$F$7=0,0,H123)","v":0},0.25,{"$f":"(G123+2*I123)/3","v":8.3333333333333329E-2},0,"kgCO2e / m²",{"$f":"-320*0.3","v":-96},{"$f":"E123*E$7*$K123*'USER TEC-Tec'!G139/1000","v":0},0,0,0]
[null,"Installation de chantier",15,null,null,null,null,null,null,null,null,{"$f":"IF(E125=\"aucun des 2\",\"\",E11*0.03*E125)","v":""},{"$f":"G11*0.03*G125","v":0},{"$f":"H11*0.03*H125","v":{"$error":"#VALUE!"}},{"$f":"I11*0.03*I125","v":0},{"$f":"(O124-M124)/$E$6*200/$P$18","v":{"$error":"#DIV/0!"}},0.3,{"$f":"IF(L124>O124,0,IF(L124<M124,Q124,(1-(L124-$M124)/($O124-$M124))*$Q124))","v":0},{"$f":"(1-(N124-$M124)/($O124-$M124))*$Q124","v":{"$error":"#VALUE!"}}]
[null,"organisation",null,{"$f":"'USER TEC-Tec'!D142","v":"-"},{"$f":"IF(D125=D127,E127,IF(D125=D128,E128,\"aucun des 2\"))","v":"aucun des 2"},{"$f":"IF('USER TEC-Tec'!E142=D127,F127,IF('USER TEC-Tec'!E142=D128,F128,\"aucun des 2\"))","v":"aucun des 2"},{"$f":"MIN(E127:E128)","v":0.8},{"$f":"F125","v":"aucun des 2"},{"$f":"MAX(E127:E128)","v":1}]
[null,null,null,"-"]
[null,null,null,"conventionnelle",1,{"$f":"E127","v":1}]
[null,null,null,"chantier vert",0.8,{"$f":"E128","v":0.8}]
[null,"Divers non affectés",16,null,null,null,null,null,null,null,null,{"$f":"E11*0.002","v":0},{"$f":"G11*0.002","v":0},{"$f":"H11*0.002","v":0},{"$f":"I11*0.002","v":0},{"$f":"(O129-M129)/$E$6*200/$P$18","v":{"$error":"#DIV/0!"}},0,{"$f":"IF(L129>O129,0,IF(L129<M129,Q129,(1-(L129-$M129)/($O129-$M129))*$Q129))","v":{"$error":"#DIV/0!"}},{"$f":"(1-(N129-$M129)/($O129-$M129))*$Q129","v":{"$error":"#DIV/0!"}}]
[null,null,null,null,null,null,null,null,null,null,"Émissions initiales de construction",{"$f":"IF(OR(L124=\"\",L119=\"\",L115=\"\",L111=\"\",L102=\"\",L94=\"\",L75=\"\",L64=\"\",L57=\"\",L51=\"\",L48=\"\",L36=\"\",L24=\"\",L22=\"\",L19=\"\"),0,L19+L22+L24+L36+L48+L51+L57+L64+L75+L94+L102+L111+L115+L119+L124+L129)","v":0},{"$f":"M19+M22+M24+M36+M48+M51+M57+M64+M75+M94+M102+M111+M115+M119+M124+M129","v":0},{"$f":"N19+N22+N24+N36+N48+N51+N57+N64+N75+N94+N102+N111+N115+N119+N124+N129","v":{"$error":"#VALUE!"}},{"$f":"O19+O22+O24+O36+O48+O51+O57+O64+O75+O94+O102+O111+O115+O119+O124+O129","v":0},{"$f":"SUM(P19:P129)","v":{"$error":"#DIV/0!"}},{"$f":"SUM(Q19:Q129)","v":13.000000000000002},{"$f":"SUM(R19:R129)","v":{"$error":"#DIV/0!"}},{"$f":"SUM(S19:S129)","v":{"$error":"#DIV/0!"}}]
[null,"Autres corps d'état",17,null,null,null,null,null,null,"kgCO2e / m² de SU",100,{"$f":"K131*E6/1000","v":0},null,null,null,null,{"$f":"Q130*100/$Q$396","v":{"$error":"#DIV/0!"}},{"$f":"R130*100/$Q$396","v":{"$error":"#DIV/0!"}},{"$f":"S130*100/$Q$396","v":{"$error":"#DIV/0!"}}]
["Énergie"]
[null,"ratios FE électricité",null,null,null,null,null,null,null,"kg CO2e / kWh",null,null,null,null,null,null,null,null,null,"kWh d'énergie finale"]
[null,"Rafraîchissement pour le confort",1,"kWh / an",{"$f":"'USER TEC-Tec'!D162","v":0},{"$f":"ROUND(F6*F174/100,0)*100","v":{"$error":"#VALUE!"}},{"$f":"G173*G174","v":0},{"$f":"H173*H174","v":{"$error":"#VALUE!"}},{"$f":"I173*I174","v":{"$error":"#DIV/0!"}},"kg CO2e / kWh",0.65,{"$f":"IF(E136=\"aucun des 3\",\"\",E134*$K134*'USER TEC-Tec'!G162/1000)","v":""},{"$f":"G134*$K134/1000","v":0},{"$f":"H134*$K134/1000","v":{"$error":"#VALUE!"}},{"$f":"I134*$K134/1000","v":{"$error":"#DIV/0!"}},{"$f":"(O134-M134)/$E$6*200","v":{"$error":"#DIV/0!"}},9.5,{"$f":"IF(L134>O134,0,IF(L134<M134,Q134,(1-(L134-$M134)/($O134-$M134))*$Q134))","v":{"$error":"#DIV/0!"}},{"$f":"(1-(N134-$M134)/($O134-$M134))*$Q134","v":{"$error":"#VALUE!"}}]
[null,"zone en ventilation naturelle + brasseurs d'air",null,"m²",{"$f":"'USER TEC-Tec'!D149","v":0},{"$f":"IF($F$6*$F$7=0,0,H135)","v":0},{"$f":"G6","v":0},{"$f":"(G135+2*I135)/3","v":0},0]
[null,"performance de l'enveloppe et de son environnement",null,{"$f":"'USER TEC-Tec'!D147","v":"-"},{"$f":"IF(D136=D138,E138,IF(D136=D139,E139,IF(D136=D140,E140,\"aucun des 3\")))","v":"aucun des 3"},{"$f":"IF('USER TEC-Tec'!E147=D138,F138,IF('USER TEC-Tec'!E147=D139,F139,IF('USER TEC-Tec'!E147=D140,F140,\"aucun des 3\")))","v":"aucun des 3"},{"$f":"MIN(E138:E140)","v":3},{"$f":"F136","v":"aucun des 3"},{"$f":"MAX(E138:E140)","v":6}]
[null,null,null,"-"]
[null,null,null,"médiocre",6,{"$f":"E138","v":6}]
[null,null,null,"correcte",4,{"$f":"E139","v":4}]
[null,null,null,"performante",3,{"$f":"E140","v":3}]
[null,"consommation unitaire",null,"kWh / m²",{"$f":"IF(E136=\"aucun des 3\",\"\",E136*6*10*20/1000)","v":""},{"$f":"IF(F136=\"aucun des 3\",\"\",F136*6*10*20/1000)","v":""},{"$f":"G136*6*10*20/1000","v":3.6},{"$f":"H136*6*10*20/1000","v":{"$error":"#VALUE!"}},{"$f":"I136*6*10*20/1000","v":7.2},null,null,null,null,null,null,null,null,null,null,"Calcul : W/m² x mois/an x h/j x j/mois  "]
[null,"zone en climatisation + ventilation naturelle + brasseurs d'air",null,"m²",{"$f":"'USER TEC-Tec'!D151","v":0},{"$f":"IF($F$6*$F$7=0,0,H142)","v":0},0,{"$f":"(G142+2*I142)/3","v":0},0]
[null,"performance de l'enveloppe et de son environnement",null,{"$f":"'USER TEC-Tec'!D147","v":"-"},{"$f":"IF(D143=D144,E144,IF(D143=D145,E145,IF(D143=D146,E146,\"aucun des 3\")))","v":"aucun des 3"},{"$f":"IF('USER TEC-Tec'!E147=D144,F144,IF('USER TEC-Tec'!E147=D145,F145,IF('USER TEC-Tec'!E147=D146,F146,\"aucun des 3\")))","v":"aucun des 3"},{"$f":"MIN(E144:E146)","v":10},{"$f":"F143","v":"aucun des 3"},{"$f":"MAX(E144:E146)","v":30}]
[null,null,null,"médiocre",30,{"$f":"E144","v":30}]
[null,null,null,"correcte",20,{"$f":"E145","v":20}]
[null,null,null,"performante",10,{"$f":"E146","v":10}]
[null,"durée de fonctionnement de la climatisation",null,{"$f":"'USER TEC-Tec'!D152","v":"-"},{"$f":"IF(D147=D149,E149,IF(D147=D150,E150,IF(D147=D151,E151,\"aucun des 3\")))","v":"aucun des 3"},{"$f":"IF('USER TEC-Tec'!E152=D149,F149,IF('USER TEC-Tec'!E152=D150,F150,IF('USER TEC-Tec'!E152=D151,F151,\"aucun des 3\")))","v":"aucun des 3"},{"$f":"MIN(E149:E151)","v":1.5},{"$f":"F147","v":"aucun des 3"},{"$f":"MAX(E149:E151)","v":6}]
[null,null,null,"-"]
[null,null,null,"très faible (environ 1 mois 1/2)",1.5,{"$f":"E149","v":1.5}]
[null,null,null,"occasionnelle (environ 3 mois)",3,{"$f":"E150","v":3}]
[null,null,null,"fréquente (environ 6 mois)",6,{"$f":"E151","v":6}]
[null,"consommation unitaire",null,"kWh / m²",{"$f":"IF(OR(E143=\"aucun des 3\",E147=\"aucun des 3\",E136=\"aucun des 3\"),\"0\",(E143*E147+E136*6)*10*20/1000)","v":"0"},{"$f":"IF(F147=\"aucun des 3\",\"\",F143*F147*10*20/1000)","v":""},{"$f":"G143*G147*10*20/1000","v":3},{"$f":"H143*H147*10*20/1000","v":{"$error":"#VALUE!"}},{"$f":"I143*I147*10*20/1000","v":36}]
[null,"zone en climatisation + brasseurs d'air",null,"m²",{"$f":"'USER TEC-Tec'!D154","v":0},{"$f":"IF($F$6*$F$7=0,0,H153)","v":0},0,{"$f":"(G153+2*I153)/3","v":0},{"$f":"I6*0.9","v":0}]
[null,"performance de l'enveloppe et de son environnement",null,{"$f":"'USER TEC-Tec'!D147","v":"-"},{"$f":"IF(D154=D155,E155,IF(D154=D156,E156,IF(D154=D157,E157,\"aucun des 3\")))","v":"aucun des 3"},{"$f":"IF('USER TEC-Tec'!E147=D155,F155,IF('USER TEC-Tec'!E147=D156,F156,IF('USER TEC-Tec'!E147=D157,F157,\"aucun des 3\")))","v":"aucun des 3"},{"$f":"MIN(E155:E157)","v":10},{"$f":"F154","v":"aucun des 3"},{"$f":"MAX(E155:E157)","v":30}]
[null,null,null,"médiocre",30,{"$f":"E155","v":30}]
[null,null,null,"correcte",20,{"$f":"E156","v":20}]
[null,null,null,"performante",10,{"$f":"E157","v":10}]
[null,"durée de fonctionnement de la climatisation",null,{"$f":"'USER TEC-Tec'!D155","v":"-"},{"$f":"IF(D158=D160,E160,IF(D158=D161,E161,\"aucun des 2\"))","v":"aucun des 2"},{"$f":"IF('USER TEC-Tec'!E155=D160,F160,IF('USER TEC-Tec'!E155=D161,F161,\"aucun des 2\"))","v":"aucun des 2"},{"$f":"MIN(E160:E161)","v":8},{"$f":"F158","v":"aucun des 2"},{"$f":"MAX(E160:E161)","v":12}]
[null,null,null,"-"]
[null,null,null,"fréquente (environ 8 mois)",8,{"$f":"E160","v":8}]
[null,null,null,"permanente (environ 12 mois)",12,{"$f":"E161","v":12}]
[null,"consommation unitaire",null,"kWh / m²",{"$f":"IF(OR(E154=\"aucun des 3\",E158=\"aucun des 2\",E136=\"aucun des 3\"),\"0\",(E154*E158+E136*6)*10*20/1000)","v":"0"},{"$f":"IF(F158=\"aucun des 3\",\"\",F154*F158*10*20/1000)","v":{"$error":"#VALUE!"}},{"$f":"G154*G158*10*20/1000","v":16},{"$f":"H154*H158*10*20/1000","v":{"$error":"#VALUE!"}},{"$f":"I154*I158*10*20/1000","v":72}]
[null,"zone en climatisation seule (hors locaux techniques)",null,"m²",{"$f":"'USER TEC-Tec'!D157","v":0},{"$f":"IF($F$6*$F$7=0,0,H163)","v":0},0,{"$f":"(G163+2*I163)/3","v":0},{"$f":"I6/10","v":0}]
[null,"performance de l'enveloppe et de son environnement",null,{"$f":"'USER TEC-Tec'!D147","v":"-"},{"$f":"IF(D164=D165,E165,IF(D164=D166,E166,IF(D164=D167,E167,\"aucun des 3\")))","v":"aucun des 3"},{"$f":"IF('USER TEC-Tec'!E147=D165,F165,IF('USER TEC-Tec'!E147=D166,F166,IF('USER TEC-Tec'!E147=D167,F167,\"aucun des 3\")))","v":"aucun des 3"},{"$f":"MIN(E165:E167)","v":20},{"$f":"F164","v":"aucun des 3"},{"$f":"MAX(E165:E167)","v":50}]
[null,null,null,"médiocre",50,{"$f":"E165","v":50}]
[null,null,null,"correcte",35,{"$f":"E166","v":35}]
[null,null,null,"performante",20,{"$f":"E167","v":20}]
[null,"durée de fonctionnement",null,{"$f":"'USER TEC-Tec'!D158","v":"-"},{"$f":"IF(D168=D170,E170,IF(D168=D171,E171,\"aucun des 2\"))","v":"aucun des 2"},{"$f":"IF('USER TEC-Tec'!E158=D170,F170,IF('USER TEC-Tec'!E158=D171,F171,\"aucun des 2\"))","v":"aucun des 2"},{"$f":"MIN(E170:E171)","v":8},{"$f":"F168","v":"aucun des 2"},{"$f":"MAX(E170:E171)","v":12}]
[null,null,null,"-"]
[null,null,null,"fréquente (environ 8 mois)",8,{"$f":"E170","v":8}]
[null,null,null,"permanente (environ 12 mois)",12,{"$f":"E171","v":12}]
[null,"consommation unitaire",null,"kWh / m²",{"$f":"IF(OR(E164=\"aucun des 3\",E168=\"aucun des 2\"),\"0\",E164*E168*10*20/1000)","v":"0"},{"$f":"IF(F168=\"aucun des 3\",\"\",F164*F168*10*20/1000)","v":{"$error":"#VALUE!"}},{"$f":"G164*G168*10*20/1000","v":32},{"$f":"H164*H168*10*20/1000","v":{"$error":"#VALUE!"}},{"$f":"I164*I168*10*20/1000","v":120}]
[null,"surface totale des quatre zones ci-dessus",null,"m²",{"$f":"E135+E142+E153+E163","v":0},{"$f":"IF($F$6*$F$7=0,0,H173)","v":0},{"$f":"G135+G142+G153+G163","v":0},{"$f":"H135+H142+H153+H163","v":0},{"$f":"I135+I142+I153+I163","v":0}]
[null,"consommation unitaire",null,"kWh / m²",{"$f":"IF(E173=0,\"0\",((E135*E141+E142*E152+E153*E162+E163*E172)/E173))","v":"0"},{"$f":"IF(OR(F172=\"\",F162=\"\",F152=\"\",F141=\"\"),0,IF(F173=0,\"\",((F135*F141+F142*F152+F153*F162+F163*F172)/F173)))","v":{"$error":"#VALUE!"}},{"$f":"IF(G173=0,0,(G135*G141+G142*G152+G153*G162+G163*G172)/G173)","v":0},{"$f":"(H135*H141+H142*H152+H153*H162+H163*H172)/H173","v":{"$error":"#VALUE!"}},{"$f":"(I135*I141+I142*I152+I153*I162+I163*I172)/I173","v":{"$error":"#DIV/0!"}}]
[null,"Fuite de fluide frigorigène",null,"kg HFC",{"$f":"'USER TEC-Tec'!D164*E177*E178","v":0},{"$f":"F176*F177*F178","v":0},{"$f":"G176*G177*G178","v":0},{"$f":"H176*H177*H178","v":0},{"$f":"I176*I177*I178","v":0},"kg CO2e / kg HFC",2000,{"$f":"E175*$K175*'USER TEC-Tec'!G164/1000","v":0},{"$f":"G175*$K175/1000","v":0},{"$f":"H175*$K175/1000","v":0},{"$f":"I175*$K175/1000","v":0},{"$f":"(O175-M175)/$E$6*200","v":{"$error":"#DIV/0!"}},3.5,{"$f":"IF(L175=0,Q175,IF(L175>O175,0,IF(L175<M175,Q175,(1-(L175-$M175)/($O175-$M175))*$Q175)))","v":3.5},{"$f":"(1-(N175-$M175)/($O175-$M175))*$Q175","v":{"$error":"#DIV/0!"}}]
[null,"puissance installée avec fluide HFC",null,"kW frigo.",{"$f":"H176","v":0},{"$f":"H176","v":0},{"$f":"90*(G142+G153+G163)/1000","v":0},{"$f":"110*(E142+E153+E163)/1000","v":0},{"$f":"120*(I142+I153+I163)/1000","v":0}]
[null,"charge en fluide HFC",null,"kg HFC / kW frigo.",{"$f":"H177","v":0.44000000000000006},{"$f":"H177","v":0.44000000000000006},0.2,{"$f":"(G177+4*I177)/5","v":0.44000000000000006},0.5]
[null,"taux de fuite",null,"% / an",{"$f":"H178","v":0.13},{"$f":"H178","v":0.13},0.05,{"$f":"(G178+4*I178)/5","v":0.13},0.15]
[null,"Éclairage intérieur",2,"kWh / an",{"$f":"'USER TEC-Tec'!D170","v":0},{"$f":"ROUND(F6*F193/100,0)*100","v":{"$error":"#VALUE!"}},{"$f":"G6*G193","v":0},{"$f":"H6*H193","v":0},{"$f":"I6*I193","v":0},"kg CO2e / kWh",0.7,{"$f":"E179*$K179*'USER TEC-Tec'!G170/1000","v":0},{"$f":"G179*$K179/1000","v":0},{"$f":"H179*$K179/1000","v":0},{"$f":"I179*$K179/1000","v":0},{"$f":"(O179-M179)/$E$6*200","v":{"$error":"#DIV/0!"}},{"$f":"1.5*(1*E180+E181*(1-E180))","v":1.5},{"$f":"IF(L179=0,0,IF(L179>O179,0,IF(L179<M179,Q179,(1-(L179-$M179)/($O179-$M179))*$Q179)))","v":0},{"$f":"(1-(N179-$M179)/($O179-$M179))*$Q179","v":{"$error":"#DIV/0!"}}]
[null,"proportion d'éclairement standard (vs surface de vente)",null,"% std de SU",{"$f":"'USER TEC-Tec'!D167","v":1},1]
[null,null,null,"fort (surface de vente)",10,{"$f":"E181","v":10}]
[null,"performance des équipements et optimisation d'installation",null,{"$f":"'USER TEC-Tec'!D168","v":"-"},{"$f":"IF(D182=D184,E184,IF(D182=D185,E185,IF(D182=D186,E186,\"aucun des 3\")))","v":"aucun des 3"},{"$f":"IF('USER TEC-Tec'!E168=D184,F184,IF('USER TEC-Tec'!E168=D185,F185,IF('USER TEC-Tec'!E168=D186,F186,\"aucun des 3\")))","v":"aucun des 3"},{"$f":"MIN(E184:E186)","v":3},{"$f":"F182","v":"aucun des 3"},{"$f":"MAX(E184:E186)","v":5}]
[null,null,null,"-"]
[null,null,null,"faible",5,{"$f":"E184","v":5}]
[null,null,null,"moyenne",4,{"$f":"E185","v":4}]
[null,null,null,"élevée",3,{"$f":"E186","v":3}]
[null,"plage de fonctionnement",null,{"$f":"'USER TEC-Tec'!D169","v":"-"},{"$f":"IF(D187=D189,E189,IF(D187=D190,E190,IF(D187=D191,E191,IF(D187=D192,E192,\"aucun des 4\"))))","v":"aucun des 4"},{"$f":"IF('USER TEC-Tec'!E169=D189,F189,IF('USER TEC-Tec'!E169=D190,F190,IF('USER TEC-Tec'!E169=D191,F191,IF('USER TEC-Tec'!E169=D192,F192,\"aucun des 4\"))))","v":"aucun des 4"},{"$f":"MIN(F189:F192)","v":2},{"$f":"F187","v":"aucun des 4"},{"$f":"MAX(F189:F192)","v":12}]
[null,null,null,"-"]
[null,null,null,"2 heures / jour",2,{"$f":"E189","v":2}]
[null,null,null,"4 heures / jour",4,{"$f":"E190","v":4}]
[null,null,null,"7 heures / jour",7,{"$f":"E191","v":7}]
[null,null,null,"12 heures / jour",12,{"$f":"E192","v":12}]
[null,"consommation unitaire",null,"kWh / m²",{"$f":"IF(OR(E182=\"aucun des 3\",E187=\"aucun des 4\"),\"\",(1*E180+E181*(1-E180))*E182*E187*10*20/1000)","v":""},{"$f":"IF(OR(F182=\"aucun des 3\",F187=\"aucun des 4\"),\"\",(1*F180+F181*(1-F180))*F182*F187*10*20/1000)","v":""},{"$f":"G182*G187*10*20/1000","v":1.2},7,12]
[null,"Éclairage extérieur",3,"kWh / an",{"$f":"'USER TEC-Tec'!D176","v":0},{"$f":"ROUND(F6*F206/100,0)*100","v":{"$error":"#VALUE!"}},{"$f":"G6*G206","v":0},{"$f":"H6*H206","v":{"$error":"#VALUE!"}},{"$f":"I6*I206","v":0},"kg CO2e / kWh",0.75,{"$f":"E194*$K194*'USER TEC-Tec'!G176/1000","v":0},{"$f":"G194*$K194/1000","v":0},{"$f":"H194*$K194/1000","v":{"$error":"#VALUE!"}},{"$f":"I194*$K194/1000","v":0},{"$f":"(O194-M194)/$E$6*200","v":{"$error":"#DIV/0!"}},1.25,{"$f":"IF(L194=0,0,IF(L194>O194,0,IF(L194<M194,Q194,(1-(L194-$M194)/($O194-$M194))*$Q194)))","v":0},{"$f":"(1-(N194-$M194)/($O194-$M194))*$Q194","v":{"$error":"#VALUE!"}}]
[null,"gestion de l'éclairage",null,{"$f":"'USER TEC-Tec'!D174","v":"-"},{"$f":"IF(D195=D197,E197,IF(D195=D198,E198,IF(D195=D199,E199,IF(D195=D200,E200,\"aucun des 4\"))))","v":"aucun des 4"},{"$f":"IF('USER TEC-Tec'!E174=D197,F197,IF('USER TEC-Tec'!E174=D198,F198,IF('USER TEC-Tec'!E174=D199,F199,IF('USER TEC-Tec'!E174=D200,F200,\"aucun des 4\"))))","v":"aucun des 4"},{"$f":"MIN(E197:E200)","v":0.2},{"$f":"F195","v":"aucun des 4"},{"$f":"MAX(E197:E200)","v":1}]
[null,null,null,"-"]
[null,null,null,"horloge simple",1,{"$f":"E197","v":1}]
[null,null,null,"horloge astronomique",0.8,{"$f":"E198","v":0.8}]
[null,null,null,"détection de présence",0.4,{"$f":"E199","v":0.4}]
[null,null,null,"interrupteurs temporisés",0.2,{"$f":"E200","v":0.2}]
[null,"zones éclairées",null,{"$f":"'USER TEC-Tec'!D175","v":"-"},{"$f":"IF(D201=D203,E203,IF(D201=D204,E204,IF(D201=D205,E205,\"aucun des 3\")))","v":"aucun des 3"},{"$f":"IF('USER TEC-Tec'!E175=D203,F203,IF('USER TEC-Tec'!E175=D204,F204,IF('USER TEC-Tec'!E175=D205,F205,\"aucun des 3\")))","v":"aucun des 3"},{"$f":"MIN(E203:E205)","v":0.5},{"$f":"F201","v":"aucun des 3"},{"$f":"MAX(E203:E205)","v":1.5}]
[null,null,null,"-"]
[null,null,null,"extérieur complet à 20 lux",1.5,{"$f":"E203","v":1.5}]
[null,null,null,"ch. piéton à 20 lux + façades",1,{"$f":"E204","v":1}]
[null,null,null,"cheminement piéton à 20 lux",0.5,{"$f":"E205","v":0.5}]
[null,"consommation unitaire",null,"kWh / m²",{"$f":"IF(OR(E195=\"aucun des 4\",E201=\"aucun des 3\"),\"\",6*E195*E201)","v":""},{"$f":"IF(OR(F195=\"aucun des 4\",F201=\"aucun des 3\"),\"\",6*F195*F201)","v":""},{"$f":"6*G195*G201","v":0.60000000000000009},{"$f":"6*H195*H201","v":{"$error":"#VALUE!"}},{"$f":"6*I195*I201","v":9}]
[null,"Traitement d'air technique",4,"kWh / an",{"$f":"'USER TEC-Tec'!D182","v":0},{"$f":"ROUND((F208*F209+F6*F212*F216)/100,0)*100","v":0},{"$f":"G208*G209+G212*G6","v":0},{"$f":"H208*H209+H212*H6","v":0},{"$f":"I208*I209+I212*I6","v":0},"kg CO2e / kWh",0.75,{"$f":"E207*$K207*'USER TEC-Tec'!G182/1000","v":0},{"$f":"G207*$K207/1000","v":0},{"$f":"H207*$K207/1000","v":0},{"$f":"I207*$K207/1000","v":0},{"$f":"(O207-M207)/$E$6*200","v":{"$error":"#DIV/0!"}},0.75,{"$f":"IF(L207=0,Q207,IF(L207>O207,0,IF(L207<M207,Q207,(1-(L207-$M207)/($O207-$M207))*$Q207)))","v":0.75},{"$f":"(1-(N207-$M207)/($O207-$M207))*$Q207","v":{"$error":"#DIV/0!"}}]
[null,"locaux techniques climatisés",null,{"$f":"IF(E208>=2,\"pièces\",\"pièce\")","v":"pièce"},{"$f":"ROUND('USER TEC-Tec'!D180,0)","v":0},{"$f":"ROUND(H208,0)","v":0},0,{"$f":"ROUND((G208+2*I208)/3,0)","v":0},{"$f":"I6*1.5/1000","v":0}]
[null,"consommation unitaire",null,"kWh / pièce",{"$f":"H209","v":2200},{"$f":"H209","v":2200},1000,{"$f":"(G209+4*I209)/5","v":2200},2500]
[null,"Fuite de fluide frigorigène",null,"kg HFC",{"$f":"E208*E211*E178","v":0},{"$f":"F208*F211*F178","v":0},{"$f":"G208*G211*G178","v":0},{"$f":"H208*H211*H178","v":0},{"$f":"I208*I211*I178","v":0},"kg CO2e / kg HFC",2000,{"$f":"E210*$K210*'USER TEC-Tec'!G182/1000","v":0},{"$f":"G210*$K210/1000","v":0},{"$f":"H210*$K210/1000","v":0},{"$f":"I210*$K210/1000","v":0},{"$f":"(O210-M210)/$E$6*200","v":{"$error":"#DIV/0!"}},0.25,{"$f":"IF(L210=0,Q210,IF(L210>O210,0,IF(L210<M210,Q210,(1-(L210-$M210)/($O210-$M210))*$Q210)))","v":0.25},{"$f":"(1-(N210-$M210)/($O210-$M210))*$Q210","v":{"$error":"#DIV/0!"}}]
[null,"puissance installée avec fluide HFC",null,"kg HFC / split",{"$f":"H211","v":2.7},{"$f":"H211","v":2.7},1.5,{"$f":"(G211+4*I211)/5","v":2.7},3]
[null,"installation VMC des sanitaires",null,{"$f":"'USER TEC-Tec'!D181","v":"-"},{"$f":"IF(D212=D214,E214,IF(D212=D215,E215,0))","v":0},{"$f":"IF(E212=D214,F214,IF(E212=D215,F215,0))","v":0},{"$f":"MIN(E214:E215)","v":0},{"$f":"F212","v":0},{"$f":"MAX(E214:E215)","v":1}]
[null,null,null,"-"]
[null,null,null,"oui",1,{"$f":"E214","v":1}]
[null,null,null,"non",0,{"$f":"E215","v":0}]
[null,"consommation unitaire",null,"kWh / m²",{"$f":"H216","v":2.2000000000000002},{"$f":"H216","v":2.2000000000000002},1,{"$f":"(G216+4*I216)/5","v":2.2000000000000002},2.5]
[null,"Forces motrices",5,"kWh / an",{"$f":"'USER TEC-Tec'!D187","v":0},{"$f":"ROUND(F218*F219/100,0)*100","v":0},{"$f":"G218*G219","v":0},{"$f":"H218*H219","v":0},{"$f":"I218*I219","v":0},"kg CO2e / kWh",0.75,{"$f":"E217*$K217*'USER TEC-Tec'!G187/1000","v":0},{"$f":"G217*$K217/1000","v":0},{"$f":"H217*$K217/1000","v":0},{"$f":"I217*$K217/1000","v":0},{"$f":"(O217-M217)/$E$6*200","v":{"$error":"#DIV/0!"}},0.25,{"$f":"IF(L217=0,Q217,IF(L217>O217,0,IF(L217<M217,Q217,(1-(L217-$M217)/($O217-$M217))*$Q217)))","v":0.25},{"$f":"(1-(N217-$M217)/($O217-$M217))*$Q217","v":{"$error":"#DIV/0!"}}]
[null,"ascenseurs ou monte-charges",null,"u",{"$f":"'USER TEC-Tec'!D186","v":0},{"$f":"ROUND(H218,0)","v":0},0,{"$f":"(G218+2*I218)/3","v":0},{"$f":"1.5*I6/1000","v":0}]
[null,"consommation unitaire",null,"kWh / ascenseur",{"$f":"H219","v":1000},{"$f":"H219","v":1000},600,{"$f":"(G219+2*I219)/3","v":1000},1200]
[null,"Cuisine",6,null,null,null,null,null,null,null,null,{"$f":"SUM(L221:L222)","v":0},{"$f":"SUM(M221:M222)","v":0},{"$f":"SUM(N221:N222)","v":{"$error":"#DIV/0!"}},{"$f":"SUM(O221:O222)","v":{"$error":"#DIV/0!"}},{"$f":"(O220-M220)/$E$6*200","v":{"$error":"#DIV/0!"}},3.5,{"$f":"IF(L220=0,Q220,IF(L220>O220,0,IF(L220<M220,Q220,(1-(L220-$M220)/($O220-$M220))*$Q220)))","v":3.5},{"$f":"(1-(N220-$M220)/($O220-$M220))*$Q220","v":{"$error":"#DIV/0!"}}]
[null,"consommation de gaz",null,"kWh / an",{"$f":"'USER TEC-Tec'!D193","v":0},{"$f":"ROUND(F6*F238/100,0)*100","v":0},0,0,0,"kg CO2e / kWh",0.3,{"$f":"E221*$K221*'USER TEC-Tec'!G193/1000","v":0},{"$f":"G221*$K221/1000","v":0},0,0]
[null,"consommation électrique",null,"kWh / an",{"$f":"'USER TEC-Tec'!D194","v":0},{"$f":"ROUND(F6*F239/100,0)*100","v":0},{"$f":"G6*G239","v":0},{"$f":"H6*H239","v":{"$error":"#DIV/0!"}},{"$f":"I6*I239","v":{"$error":"#DIV/0!"}},"kg CO2e / kWh",0.65,{"$f":"E222*$K222*'USER TEC-Tec'!G194/1000","v":0},0,{"$error":"#DIV/0!"},{"$error":"#DIV/0!"}]
[null,"type de cuisine",null,{"$f":"'USER TEC-Tec'!D190","v":"-"},{"$f":"IF(D223=D225,E225,IF(D223=D226,E226,IF(D223=D227,E227,IF(D223=D228, E228,IF(D223=D229,E229,\"aucun des 5\")))))","v":"aucun des 5"},{"$f":"IF('USER TEC-Tec'!E190=D225,F225,IF('USER TEC-Tec'!E190=D226,F226,IF('USER TEC-Tec'!E190=D227,F227,IF('USER TEC-Tec'!E190=D228,F228,IF('USER TEC-Tec'!E190=D229,F229,\"aucun des 5\")))))","v":"aucun des 5"},{"$f":"MIN(E225:E229)","v":0},{"$f":"F223","v":"aucun des 5"},{"$f":"MAX(E225:E229)","v":900}]
[null,null,null,"-"]
[null,null,null,"sans cuisine",0,{"$f":"E225","v":0}]
[null,null,null,"liaison chaude",{"$f":"10+20+100","v":130},{"$f":"E226","v":130},null,null,null,null,null,null,null,null,null,null,null,null,null,"Réfrigération + Rechauffage + Lavage"]
[null,null,null,"liaison froide",{"$f":"50+100+100","v":250},{"$f":"E227","v":250},null,null,null,null,null,null,null,null,null,null,null,null,null,"Réfrigération + Rechauffage + Lavage"]
[null,null,null,"production de repas (électrique)",{"$f":"200+500+200","v":900},{"$f":"E228","v":900},null,null,null,null,null,null,null,null,null,null,null,null,null,"Réfrigération + Cuisson + Lavage"]
[null,null,null,"production de repas (gaz)",{"$f":"200+100+200","v":500},{"$f":"E229","v":500},null,null,null,null,null,null,null,null,null,null,null,null,null,"Réfrigération + Cuisson + Lavage"]
[null,"eau chaude pour la cuisine",null,{"$f":"'USER TEC-Tec'!D191","v":"-"},{"$f":"IF(D230=D232,E232,IF(D230=D233,E233,IF(D230=D234,E234,IF(D230=D235, E235,IF(D230=D236,E236,\"aucun des 5\")))))","v":"aucun des 5"},{"$f":"IF('USER TEC-Tec'!E191=D232,F232,IF('USER TEC-Tec'!E191=D233,F233,IF('USER TEC-Tec'!E191=D234,F234,IF('USER TEC-Tec'!E191=D235,F235,IF('USER TEC-Tec'!E191=D236,F236,\"aucun des 5\")))))","v":"aucun des 5"},{"$f":"MIN(E232:E236)","v":0},{"$f":"F230","v":"aucun des 5"},{"$f":"MAX(E232:E236)","v":150}]
[null,null,null,"-"]
[null,null,null,"sans (ou sur ECS)",0,{"$f":"E232","v":0}]
[null,null,null,"électrique",150,{"$f":"E233","v":150}]
[null,null,null,"solaire + appoint électrique",50,{"$f":"E234","v":50}]
[null,null,null,"thermodynamique",60,{"$f":"E235","v":60}]
[null,null,null,"gaz",0,{"$f":"E236","v":0}]
[null,"fréquentation (dimensionnement)",null,"couverts / jour",{"$f":"ROUND('USER TEC-Tec'!D192,0)","v":0},{"$f":"H237","v":0},0,{"$f":"(G237+2*I237)/3","v":0},{"$f":"I6*0.12","v":0}]
[null,"consommation unitaire de gaz",null,"kWh / m²",{"$f":"(IF(D223=\"production de repas (gaz)\",400,0)+IF(D230=\"gaz\",150,0))*E$237*250/E$6/1000","v":{"$error":"#DIV/0!"}},0,0,0,0]
[null,"consommation unitaire électrique",null,"kWh / m²",{"$f":"(IF(E223=\"aucun des 5\",0,E223)+IF(E230=\"aucun des 5\",0,E230))*E$237*250/E$6/1000","v":{"$error":"#DIV/0!"}},{"$f":"IF(F223=\"aucun des 5\",0,(F223+F230)*F$237*250/F$6/1000)","v":0},0,{"$f":"(G239+2*I239)/3","v":{"$error":"#DIV/0!"}},{"$f":"I237*I223*250/1000/I6","v":{"$error":"#DIV/0!"}}]
[null,"Prises de courant",7,{"$f":"'USER TEC-Tec'!D197","v":"-"},{"$f":"IF(D240=D242,E242,IF(D240=D243,E243,\"aucun des 2\"))","v":"aucun des 2"},{"$f":"IF('USER TEC-Tec'!E197=D242,F242,IF('USER TEC-Tec'!E197=D243,F243,\"aucun des 2\"))","v":"aucun des 2"},{"$f":"MIN(E242:E243)","v":0.75},{"$f":"F240","v":"aucun des 2"},{"$f":"MAX(E242:E243)","v":1}]
[null,null,null,"-"]
[null,null,null,"sans gestion",1,{"$f":"E242","v":1}]
[null,null,null,"extinction auto. des veilles",0.75,{"$f":"E243","v":0.75}]
[null,"prises de courant permanentes",null,"kWh / an",{"$f":"'USER TEC-Tec'!D198","v":0},{"$f":"ROUND(F6*F240*F245/100,0)*100","v":{"$error":"#VALUE!"}},{"$f":"G$6*G240*G245","v":0},{"$f":"H$6*H240*H245","v":{"$error":"#VALUE!"}},{"$f":"I$6*I240*I245","v":0},"kg CO2e / kWh",0.75,{"$f":"E244*$K244*'USER TEC-Tec'!G198/1000","v":0},{"$f":"G244*$K244/1000","v":0},{"$f":"H244*$K244/1000","v":{"$error":"#VALUE!"}},{"$f":"I244*$K244/1000","v":0},{"$f":"(O244-M244)/$E$6*200","v":{"$error":"#DIV/0!"}},0.25,{"$f":"IF(L244=0,0,IF(L244>O244,0,IF(L244<M244,Q244,(1-(L244-$M244)/($O244-$M244))*$Q244)))","v":0},{"$f":"(1-(N244-$M244)/($O244-$M244))*$Q244","v":{"$error":"#VALUE!"}}]
[null,"consommation unitaire",null,"kWh / m²",{"$f":"H245","v":4},{"$f":"H245","v":4},{"$f":"H245","v":4},{"$f":"IF($E$5=$E$400,K$400,IF($E$5=$E$401,K$401,IF($E$5=$E$402,K$402,K$403)))","v":4},{"$f":"H245","v":4}]
[null,"bureautique",null,{"$f":"'USER TEC-Tec'!D199","v":"-"},{"$f":"IF(D246=D248,E248,IF(D246=D249,E249,\"aucun des 2\"))","v":"aucun des 2"},{"$f":"IF('USER TEC-Tec'!E199=D248,F248,IF('USER TEC-Tec'!E199=D249,F249,\"aucun des 2\"))","v":"aucun des 2"},{"$f":"MIN(E248:E249)","v":0.5},{"$f":"F246","v":"aucun des 2"},{"$f":"MAX(E248:E249)","v":1}]
[null,null,null,"-"]
[null,null,null,"standard",1,{"$f":"E248","v":1}]
[null,null,null,"à faible consommation",0.5,{"$f":"E249","v":0.5}]
[null,"prises de courant intermittentes",null,"kWh / an",{"$f":"'USER TEC-Tec'!D200","v":0},{"$f":"ROUND(F6*F246*F251/100,0)*100","v":{"$error":"#VALUE!"}},{"$f":"G$6*G246*G251","v":0},{"$f":"H$6*H246*H251","v":{"$error":"#VALUE!"}},{"$f":"I$6*I246*I251","v":0},"kg CO2e / kWh",0.7,{"$f":"E250*$K250*'USER TEC-Tec'!G200/1000","v":0},{"$f":"G250*$K250/1000","v":0},{"$f":"H250*$K250/1000","v":{"$error":"#VALUE!"}},{"$f":"I250*$K250/1000","v":0},{"$f":"(O250-M250)/$E$6*200","v":{"$error":"#DIV/0!"}},0.5,{"$f":"IF(L250=0,0,IF(L250>O250,0,IF(L250<M250,Q250,(1-(L250-$M250)/($O250-$M250))*$Q250)))","v":0},{"$f":"(1-(N250-$M250)/($O250-$M250))*$Q250","v":{"$error":"#VALUE!"}}]
[null,"consommation unitaire",null,"kWh / m²",{"$f":"H251","v":4},{"$f":"H251","v":4},{"$f":"H251","v":4},{"$f":"IF($E$5=$E$400,L$400,IF($E$5=$E$401,L$401,IF($E$5=$E$402,L$402,L$403)))","v":4},{"$f":"H251","v":4}]
[null,"Eau Chaude Sanitaire",8,"kWh électrique / an",{"$f":"'USER TEC-Tec'!D205","v":0},{"$f":"ROUND(F6*F253/100,0)*100","v":{"$error":"#VALUE!"}},{"$f":"G$6*G253","v":0},{"$f":"H$6*H253","v":{"$error":"#VALUE!"}},{"$f":"I$6*I253","v":0},"kg CO2e / kWh",0.75,{"$f":"E252*$K252*'USER TEC-Tec'!G205/1000","v":0},{"$f":"G252*$K252/1000","v":0},{"$f":"H252*$K252/1000","v":{"$error":"#VALUE!"}},{"$f":"I252*$K252/1000","v":0},{"$f":"(O252-M252)/$E$6*200","v":{"$error":"#DIV/0!"}},2.25,{"$f":"IF(L252=0,Q252,IF(L252>O252,0,IF(L252<M252,Q252,(1-(L252-$M252)/($O252-$M252))*$Q252)))","v":2.25},{"$f":"(1-(N252-$M252)/($O252-$M252))*$Q252","v":{"$error":"#VALUE!"}}]
[null,"consommation unitaire",null,{"$f":"'USER TEC-Tec'!D204","v":"-"},{"$f":"IF(D253=D255,E255,IF(D253=D256,E256,IF(D253=D257,E257,IF(D253=D258, E258,IF(D253=D259,E259,IF(D253=D260,E260,\"aucun des 6\"))))))","v":"aucun des 6"},{"$f":"IF('USER TEC-Tec'!E204=D255,F255,IF('USER TEC-Tec'!E204=D256,F256,IF('USER TEC-Tec'!E204=D257,F257,IF('USER TEC-Tec'!E204=D258,F258,IF('USER TEC-Tec'!E204=D259,F259,IF('USER TEC-Tec'!E204=D260,F260,\"aucun des 6\"))))))","v":"aucun des 6"},{"$f":"MIN(E255:E260)","v":0},{"$f":"F253","v":"aucun des 6"},{"$f":"MAX(E255:E260)","v":10}]
[null,null,null,"-"]
[null,null,null,"sans",0,{"$f":"E255","v":0}]
[null,null,null,"100 % solaire",0.2,0.2]
[null,null,null,"solaire + appoint électrique",2,2]
[null,null,null,"thermodynamique",2,2]
[null,null,null,"ballon élec. à accumulateur",5,5]
[null,null,null,"chauffe-eau instantané",10,10,null,null,null,null,null,null,null,null,null,null,null,null,null,"Conso CE instantané à vérifier"]
[null,"Froid commercial",9,"kWh / an",{"$f":"'USER TEC-Tec'!D213","v":0},{"$f":"F279","v":0},{"$f":"G262*G264+G263*G269+G273*G274","v":0},{"$f":"(G261+2*I261)/3","v":0},{"$f":"I262*I264+I263*I269+I273*I274","v":0},"kg CO2e / kWh",0.7,{"$f":"E261*$K261*'USER TEC-Tec'!G213/1000","v":0},{"$f":"G261*$K261/1000","v":0},{"$f":"H261*$K261/1000","v":0},{"$f":"I261*$K261/1000","v":0},{"$f":"(O261-M261)/$E$6*200","v":{"$error":"#DIV/0!"}},{"$f":"ROUND(L261*180/E$6+0.5,0)","v":{"$error":"#DIV/0!"}},{"$f":"IF(L261=0,Q261,IF(L261>O261,0,IF(L261<M261,Q261,(1-(L261-$M261)/($O261-$M261))*$Q261)))","v":{"$error":"#DIV/0!"}},{"$f":"IF(O261=0,0,(1-(N261-$M261)/($O261-$M261))*$Q261)","v":0}]
[null,"surface de chambres froides positives",null,"m²",{"$f":"'USER TEC-Tec'!D208","v":0},{"$f":"IF($F$6*$F$7=0,0,H262)","v":0},0,{"$f":"E262","v":0},{"$f":"E262","v":0}]
[null,"surface de chambres froides négatives",null,"m²",{"$f":"'USER TEC-Tec'!D209","v":0},{"$f":"IF($F$6*$F$7=0,0,H263)","v":0},0,{"$f":"E263","v":0},{"$f":"E263","v":0}]
[null,"performance des systèmes",null,{"$f":"'USER TEC-Tec'!D210","v":"-"},{"$f":"IF(D264=D266,E266,IF(D264=D267,E267,IF(D264=D268,E268,\"aucun des 3\")))","v":"aucun des 3"},{"$f":"IF('USER TEC-Tec'!E205=D266,F266,IF('USER TEC-Tec'!E205=D267,F267,IF('USER TEC-Tec'!E205=D268,F268,\"aucun des 3\")))","v":"aucun des 3"},{"$f":"MIN(E266:E268)","v":2000},{"$f":"F264","v":"aucun des 3"},{"$f":"MAX(E266:E268)","v":3000}]
[null,null,null,"-"]
[null,null,null,"faible",3000,{"$f":"E266","v":3000}]
[null,null,null,"moyenne",2500,{"$f":"E267","v":2500}]
[null,null,null,"élevée",2000,{"$f":"E268","v":2000}]
[null,"valeur froid négatif",null,{"$f":"D264","v":"-"},{"$f":"IF(D269=D270,E270,IF(D269=D271,E271,IF(D269=D272,E272,\"aucun des 3\")))","v":"aucun des 3"},{"$f":"IF('USER TEC-Tec'!E210=D270,F270,IF('USER TEC-Tec'!E210=D271,F271,IF('USER TEC-Tec'!E210=D272,F272,\"aucun des 3\")))","v":"aucun des 3"},{"$f":"MIN(E270:E272)","v":4000},{"$f":"F269","v":"aucun des 3"},{"$f":"MAX(E270:E272)","v":6000}]
[null,null,null,"faible",6000,{"$f":"E270","v":6000}]
[null,null,null,"moyenne",5000,{"$f":"E271","v":5000}]
[null,null,null,"élevée",4000,{"$f":"E272","v":4000}]
[null,"meubles frigorifiques de vente",null,"mL",{"$f":"'USER TEC-Tec'!D211","v":0},{"$f":"IF($F$6*$F$7=0,0,H273)","v":0},0,{"$f":"E273","v":0},{"$f":"E273","v":0}]
[null,"performance des systèmes",null,{"$f":"'USER TEC-Tec'!D212","v":"-"},{"$f":"IF(D274=D276,E276,IF(D274=D277,E277,IF(D274=D278,E278,\"aucun des 3\")))","v":"aucun des 3"},{"$f":"IF('USER TEC-Tec'!E212=D276,F276,IF('USER TEC-Tec'!E212=D277,F277,IF('USER TEC-Tec'!E212=D278,F278,\"aucun des 3\")))","v":"aucun des 3"},{"$f":"MIN(E276:E278)","v":2000},{"$f":"F274","v":"aucun des 3"},{"$f":"MAX(E276:E278)","v":4000}]
[null,null,null,"-"]
[null,null,null,"faible",4000,{"$f":"E276","v":4000}]
[null,null,null,"moyenne",3000,{"$f":"E277","v":3000}]
[null,null,null,"élevée",2000,{"$f":"E278","v":2000}]
[null,"consommation",null,"kWh / an",{"$f":"IF(E264=\"aucun des 3\",0,E262*E264)+IF(E269=\"aucun des 3\",0,E263*E269)+IF(E274=\"aucun des 3\",0,E273*E274)","v":0},{"$f":"IF(F264=\"aucun des 3\",0,F262*F264)+IF(F269=\"aucun des 3\",0,F263*F269)+IF(F274=\"aucun des 3\",0,F273*F274)","v":0}]
[null,"Consommation totale d'électricité",null,null,{"$f":"E134+E179+E194+E207+E217+E222+E244+E250+E252+E261","v":0},{"$f":"F134+F179+F194+F207+F217+F222+F244+F250+F252+F261","v":{"$error":"#VALUE!"}}]
[null,"Production d'électricité",10,"kWh / an",{"$f":"E283+E285","v":0},{"$f":"F283+F285","v":0},{"$f":"G283+G285","v":0},{"$f":"H283+H285","v":0},{"$f":"I283+I285","v":0},null,null,{"$f":"L283+L285","v":0},{"$f":"M282+M284","v":0},{"$f":"N282+N284","v":0},{"$f":"O282+O284","v":0},{"$f":"(O281-M281)/$E$6*200","v":{"$error":"#DIV/0!"}},20,{"$f":"IF(L281>O281,0,IF(L281<M281,Q281,(1-(L281-$M281)/($O281-$M281))*$Q281))","v":{"$error":"#DIV/0!"}},{"$f":"(1-(N281-$M281)/($O281-$M281))*$Q281","v":{"$error":"#DIV/0!"}}]
[null,"en phase avec l'ensoleillement",null,"kWh / an",{"$f":"E117*1400","v":0},{"$f":"H282","v":0},{"$f":"I117*1400","v":0},{"$f":"H117*1400","v":0},{"$f":"G117*1400","v":0},"kg CO2e / kWh",-0.65,null,{"$f":"G282*$K282/1000","v":0},{"$f":"H282*$K282/1000","v":0},{"$f":"I282*$K282/1000","v":0}]
[null,null,null,"kWh / an",{"$f":"IF(CODE('USER TEC-Tec'!D220)=101,E282,'USER TEC-Tec'!D220)","v":0},null,null,null,null,"kg CO2e / kWh",{"$f":"K282","v":-0.65},{"$f":"E283*$K283*'USER TEC-Tec'!G220/1000","v":0}]
[null,"lissée grâce aux batteries",null,"kWh / an",{"$f":"E118*1400","v":0},{"$f":"H284","v":0},{"$f":"I118*1400","v":0},{"$f":"H118*1400","v":0},{"$f":"G118*1400","v":0},"kg CO2e / kWh",-0.75,null,{"$f":"G284*$K284/1000","v":0},{"$f":"H284*$K284/1000","v":0},{"$f":"I284*$K284/1000","v":0}]
[null,null,null,"kWh / an",{"$f":"IF(CODE('USER TEC-Tec'!D221)=101,E284,'USER TEC-Tec'!D221)","v":0},null,null,null,null,"kg CO2e / kWh",{"$f":"K284","v":-0.75},{"$f":"E285*$K285*'USER TEC-Tec'!G221/1000","v":0}]
[null,"Commissionnement et exploitation",11,"kWh / an",{"$f":"IF(OR(E287=\"aucun des 2\",E291=\"aucun des 3\"),0,(E287*E291-1)*E280)","v":0},{"$f":"(F287*F291-1)*F280","v":{"$error":"#VALUE!"}},{"$f":"(G287*G291-1)*(G134+G179+G194+G207+G217+G222+G244+G250+G252)","v":0},{"$f":"(H287*H291-1)*(H134+H179+H194+H207+H217+H222+H244+H250+H252)","v":{"$error":"#VALUE!"}},{"$f":"(I287*I291-1)*(I134+I179+I194+I207+I217+I222+I244+I250+I252)","v":{"$error":"#DIV/0!"}},"kg CO2e / kWh",0.7,{"$f":"IF(OR(E287=\"aucun des 2\",E291=\"aucun des 3\"),\"\",E286*$K286*('USER TEC-Tec'!G225+'USER TEC-Tec'!G226)/2/1000)","v":""},{"$f":"G286*$K286/1000","v":0},{"$f":"H286*$K286/1000","v":{"$error":"#VALUE!"}},{"$f":"I286*$K286/1000","v":{"$error":"#DIV/0!"}},{"$f":"(O286-M286)/$E$6*200","v":{"$error":"#DIV/0!"}},9,{"$f":"IF(L286>O286,0,IF(L286<M286,Q286,(1-(L286-$M286)/($O286-$M286))*$Q286))","v":{"$error":"#DIV/0!"}},{"$f":"(1-(N286-$M286)/($O286-$M286))*$Q286","v":{"$error":"#VALUE!"}}]
[null,"commissionnement",null,{"$f":"'USER TEC-Tec'!D225","v":"-"},{"$f":"IF(D287=D289,E289,IF(D287=D290,E290,\"aucun des 2\"))","v":"aucun des 2"},{"$f":"IF('USER TEC-Tec'!E225=D289,F289,IF('USER TEC-Tec'!E225=D290,F290,\"aucun des 2\"))","v":"aucun des 2"},{"$f":"MIN(E289:E290)","v":1},{"$f":"F287","v":"aucun des 2"},{"$f":"MAX(E289:E290)","v":1.2}]
[null,null,null,"-"]
[null,null,null,"oui",1,{"$f":"E289","v":1}]
[null,null,null,"non",1.2,{"$f":"E290","v":1.2}]
[null,"gestion de l'exploitation",null,{"$f":"'USER TEC-Tec'!D226","v":"-"},{"$f":"IF(D291=D293,E293,IF(D291=D294,E294,IF(D291=D295,E295,\"aucun des 3\")))","v":"aucun des 3"},{"$f":"IF('USER TEC-Tec'!E226=D293,F293,IF('USER TEC-Tec'!E226=D294,F294,IF('USER TEC-Tec'!E226=D295,F295,\"aucun des 3\")))","v":"aucun des 3"},{"$f":"MIN(E293:E295)","v":0.8},{"$f":"F291","v":"aucun des 3"},{"$f":"MAX(E293:E295)","v":1.2}]
[null,null,null,"-"]
[null,null,null,"non",1.2,{"$f":"E293","v":1.2}]
[null,null,null,"partielle",1,{"$f":"E294","v":1}]
[null,null,null,"totale",0.8,{"$f":"E295","v":0.8},null,null,null,null,null,null,null,null,null,null,"hors PV"]
[null,null,null,null,null,null,null,null,null,null,{"$f":"A132","v":"Énergie"},{"$f":"IF(L286=\"\",0,SUM(L133:L281)+L286)","v":0},{"$f":"SUM(M133:M281)+M286","v":0},{"$f":"SUM(N133:N281)+N286","v":{"$error":"#VALUE!"}},{"$f":"SUM(O133:O281)+O286","v":{"$error":"#DIV/0!"}},{"$f":"SUM(P133:P286)","v":{"$error":"#DIV/0!"}},{"$f":"SUM(Q133:Q286)-Q281","v":{"$error":"#DIV/0!"}},{"$f":"SUM(R133:R286)","v":{"$error":"#DIV/0!"}},{"$f":"SUM(S133:S286)","v":{"$error":"#VALUE!"}}]
[null,"Note partielle",null,null,null,null,null,null,null,null,null,null,null,null,null,null,{"$f":"Q296*100/$Q$396","v":{"$error":"#DIV/0!"}},{"$f":"IF(R296>Q296,Q297,R296*100/$Q$396)","v":{"$error":"#DIV/0!"}},{"$f":"S296*100/$Q$396","v":{"$error":"#VALUE!"}}]
[null,"sans PV",null,null,null,null,null,null,null,null,null,null,null,null,null,null,null,{"$f":"(R296-R281)*100/$Q$396","v":{"$error":"#DIV/0!"}},{"$f":"(S296-S281)*100/$Q$396","v":{"$error":"#VALUE!"}}]
["Déplacements","effectif quotidien total",null,null,{"$f":"+'USER TEC-Tec'!D230","v":0},{"$f":"+E6*(H363/15+H364/2+H365/5)","v":0}]
[null,"Personnel",12,null,null,null,null,null,null,null,null,{"$f":"SUM(L301:L320)","v":0},{"$f":"SUM(M301:M320)","v":0},{"$f":"SUM(N301:N320)","v":{"$error":"#VALUE!"}},{"$f":"SUM(O301:O320)","v":0},{"$f":"(O300-M300)/$E$6*200","v":{"$error":"#DIV/0!"}},20,{"$f":"IF(L300=0,0,IF(L300>O300,0,IF(L300<M300,Q300,(1-(L300-$M300)/($O300-$M300))*$Q300)))","v":0},{"$f":"(1-(N300-$M300)/($O300-$M300))*$Q300","v":{"$error":"#VALUE!"}}]
[null,"distance moyenne depuis le domicile",null,"km aller",{"$f":"'USER TEC-Tec'!D233","v":0},{"$f":"'USER TEC-Tec'!E233","v":0},5,{"$f":"(G301+I301)/2","v":15},25,"kg CO2e / km aller",{"$f":"200*0.2*2","v":80},{"$f":"IF($F$299<>0,E301*$K301*'USER TEC-Tec'!G233/1000*E6/15*0.8*$E$299/$F$299,0)","v":0},{"$f":"IF($F$299<>0,G301*$K301/1000*G6/15*0.8*$E$299/$F$299,0)","v":0},{"$f":"IF($F$299<>0,H301*$K301/1000*H6/15*0.8*$E$299/$F$299,0)","v":0},{"$f":"IF($F$299<>0,I301*$K301/1000*I6/15*0.8*$E$299/$F$299,0)","v":0},null,null,null,null,"hyp. suivant BDD"]
[null,"taux de télétravail (ou de tiers-lieu local)",null,"% hebdo.",{"$f":"'USER TEC-Tec'!D234","v":0},{"$f":"'USER TEC-Tec'!E234","v":0},0.4,{"$f":"(G302+2*I302)/3","v":0.13333333333333333},0,"transfert modal",{"$f":"E302/2","v":0},{"$f":"-E302*$K302*'USER TEC-Tec'!G234*L$301*1","v":0},{"$f":"-G302*$K302*M$301*1","v":0},{"$f":"-H302*$K302*N$301*1","v":0},{"$f":"-I302*$K302*O$301*1","v":0},null,null,null,null,"idem"]
[null,"disponibilité de transports en commun",null,{"$f":"'USER TEC-Tec'!D235","v":"-"},{"$f":"IF(D303=D305,E305,IF(D303=D306,E306,IF(D303=D307,E307,IF(D303=D308,E308,\"aucun des 4\"))))","v":"aucun des 4"},{"$f":"IF('USER TEC-Tec'!E235=D305,F305,IF('USER TEC-Tec'!E235=D306,F306,IF('USER TEC-Tec'!E235=D307,F307,IF('USER TEC-Tec'!E235=D308,F308,\"aucun des 4\"))))","v":"aucun des 4"},{"$f":"MAX(E305:E308)","v":1},{"$f":"F303","v":"aucun des 4"},{"$f":"MIN(E305:E308)","v":0},"transfert modal",0.2,{"$f":"IF(E303=\"aucun des 4\",\"\",-E303*$K303*'USER TEC-Tec'!G235*L$301*0.75)","v":""},{"$f":"-G303*$K303*M$301*0.75","v":0},{"$f":"-H303*$K303*N$301*0.75","v":{"$error":"#VALUE!"}},{"$f":"-I303*$K303*O$301*0.75","v":0}]
[null,null,null,"-"]
[null,null,null,"aucune",0,{"$f":"E305","v":0}]
[null,null,null,"faible",0.2,{"$f":"E306","v":0.2}]
[null,null,null,"une ligne à proximité",0.5,{"$f":"E307","v":0.5}]
[null,null,null,"maillage à proximité",1,{"$f":"E308","v":1}]
[null,"emplacements de voitures électriques",null,{"$f":"'USER TEC-Tec'!D236","v":"-"},{"$f":"IF(D309=D311,E311,IF(D309=D312,E312,IF(D309=D313,E313,IF(D309=D314,E314,\"aucun des 4\"))))","v":"aucun des 4"},{"$f":"IF('USER TEC-Tec'!E236=D311,F311,IF('USER TEC-Tec'!E236=D312,F312,IF('USER TEC-Tec'!E236=D313,F313,IF('USER TEC-Tec'!E236=D314,F314,\"aucun des 4\"))))","v":"aucun des 4"},{"$f":"MAX(E311:E314)","v":1},{"$f":"F309","v":"aucun des 4"},{"$f":"MIN(E311:E314)","v":0},"transfert modal",0.2,{"$f":"IF(E309=\"aucun des 4\",\"\",-E309*$K309*'USER TEC-Tec'!G236*L$301*0.5)","v":""},{"$f":"-G309*$K309*M$301*0.5","v":0},{"$f":"-H309*$K309*N$301*0.5","v":{"$error":"#VALUE!"}},{"$f":"-I309*$K309*O$301*0.5","v":0},null,null,null,null,"hyp."]
[null,null,null,"-"]
[null,null,null,"aucun",0,{"$f":"E311","v":0}]
[null,null,null,"symboliques",0.2,{"$f":"E312","v":0.2}]
[null,null,null,"nombreux",0.5,{"$f":"E313","v":0.5}]
[null,null,null,"nombreux + pool de VE",1,{"$f":"E314","v":1}]
[null,"emplacements pour deux-roues",null,{"$f":"'USER TEC-Tec'!D237","v":"-"},{"$f":"IF(D315=D317,E317,IF(D315=D318,E318,IF(D315=D319,E319,IF(D315=D320,E320,\"aucun des 4\"))))","v":"aucun des 4"},{"$f":"IF('USER TEC-Tec'!E237=D317,F317,IF('USER TEC-Tec'!E237=D318,F318,IF('USER TEC-Tec'!E237=D319,F319,IF('USER TEC-Tec'!E237=D320,F320,\"aucun des 4\"))))","v":"aucun des 4"},{"$f":"MAX(E317:E320)","v":1},{"$f":"F315","v":"aucun des 4"},{"$f":"MIN(E317:E320)","v":0},"transfert modal",0.2,{"$f":"IF(E315=\"aucun des 4\",\"\",-E315*$K315*'USER TEC-Tec'!G237*L$301*0.9)","v":""},{"$f":"-G315*$K315*M$301*0.9","v":0},{"$f":"-H315*$K315*N$301*0.9","v":{"$error":"#VALUE!"}},{"$f":"-I315*$K315*O$301*0.9","v":0},null,null,null,null,"hyp."]
[null,null,null,"-"]
[null,null,null,"aucun",0,{"$f":"E317","v":0}]
[null,null,null,"abri mis en valeur",0.5,{"$f":"E318","v":0.5}]
[null,null,null,"local sécurisé et bornes élec.",0.8,{"$f":"E319","v":0.8}]
[null,null,null,"local sécurisé et offre de VAE",1,{"$f":"E320","v":1}]
[null,"Élèves ou étudiants",13,null,null,null,null,null,null,null,null,{"$f":"SUM(L322:L341)","v":0},{"$f":"SUM(M322:M341)","v":0},{"$f":"SUM(N322:N341)","v":{"$error":"#VALUE!"}},{"$f":"SUM(O322:O341)","v":0},{"$f":"(O321-M321)/$E$6*200","v":{"$error":"#DIV/0!"}},20,{"$f":"IF(L321=0,0,IF(L321>O321,0,IF(L321<M321,Q321,(1-(L321-$M321)/($O321-$M321))*$Q321)))","v":0},{"$f":"(1-(N321-$M321)/($O321-$M321))*$Q321","v":{"$error":"#VALUE!"}}]
[null,{"$f":"B301","v":"distance moyenne depuis le domicile"},null,"km aller",{"$f":"'USER TEC-Tec'!D240","v":0},{"$f":"'USER TEC-Tec'!E240","v":0},{"$f":"G301/3","v":1.6666666666666667},{"$f":"(G322+I322)/2","v":4.333333333333333},7,"kg CO2e / km aller",{"$f":"200*0.1*2","v":40},{"$f":"IF($F$299<>0,E322*$K322*'USER TEC-Tec'!G240/1000*E6/2*0.8*$E$299/$F$299,0)","v":0},{"$f":"IF($F$299<>0,G322*$K322/1000*G6/2*0.8*$E$299/$F$299,0)","v":0},{"$f":"IF($F$299<>0,H322*$K322/1000*H6/2*0.8*$E$299/$F$299,0)","v":0},{"$f":"IF($F$299<>0,I322*$K322/1000*I6/2*0.8*$E$299/$F$299,0)","v":0},null,null,null,null,"Distance BDD 3 fois moindre que DT"]
[null,{"$f":"B302","v":"taux de télétravail (ou de tiers-lieu local)"},null,"% hebdo.",{"$f":"'USER TEC-Tec'!D241","v":0},{"$f":"'USER TEC-Tec'!E241","v":0},0.2,{"$f":"(G323+2*I323)/3","v":6.6666666666666666E-2},0,"transfert modal",{"$f":"E323/2","v":0},{"$f":"-E323*$K323*'USER TEC-Tec'!G241*L$322*1","v":0},{"$f":"-G323*$K323*M$322*1","v":0},{"$f":"-H323*$K323*N$322*1","v":0},{"$f":"-I323*$K323*O$322*1","v":0},null,null,null,null,"idem"]
[null,{"$f":"B303","v":"disponibilité de transports en commun"},null,{"$f":"'USER TEC-Tec'!D242","v":"-"},{"$f":"IF(D324=D326,E326,IF(D324=D327,E327,IF(D324=D328,E328,IF(D324=D329,E329,\"aucun des 4\"))))","v":"aucun des 4"},{"$f":"IF('USER TEC-Tec'!E242=D326,F326,IF('USER TEC-Tec'!E242=D327,F327,IF('USER TEC-Tec'!E242=D328,F328,IF('USER TEC-Tec'!E242=D329,F329,\"aucun des 4\"))))","v":"aucun des 4"},{"$f":"MAX(E326:E329)","v":1},{"$f":"F324","v":"aucun des 4"},{"$f":"MIN(E326:E329)","v":0},"transfert modal",0.4,{"$f":"IF(E324=\"aucun des 4\",\"\",-E324*$K324*'USER TEC-Tec'!G242*SUM(L$322:L$323)*0.75)","v":""},{"$f":"-G324*$K324*SUM(M$322:M$323)*0.75","v":0},{"$f":"-H324*$K324*SUM(N$322:N$323)*0.75","v":{"$error":"#VALUE!"}},{"$f":"-I324*$K324*SUM(O$322:O$323)*0.75","v":0},null,null,null,null,"hyp."]
[null,null,null,"-"]
[null,null,null,"aucune",0,{"$f":"E326","v":0}]
[null,null,null,"faible",0.2,{"$f":"E327","v":0.2}]
[null,null,null,"une ligne à proximité",0.5,{"$f":"E328","v":0.5}]
[null,null,null,"maillage à proximité",1,{"$f":"E329","v":1}]
[null,{"$f":"B309","v":"emplacements de voitures électriques"},null,{"$f":"'USER TEC-Tec'!D243","v":"-"},{"$f":"IF(D330=D332,E332,IF(D330=D333,E333,IF(D330=D334,E334,IF(D330=D335,E335,\"aucun des 4\"))))","v":"aucun des 4"},{"$f":"IF('USER TEC-Tec'!E243=D332,F332,IF('USER TEC-Tec'!E243=D333,F333,IF('USER TEC-Tec'!E243=D334,F334,IF('USER TEC-Tec'!E243=D335,F335,\"aucun des 4\"))))","v":"aucun des 4"},{"$f":"MAX(E332:E335)","v":1},{"$f":"F330","v":"aucun des 4"},{"$f":"MIN(E332:E335)","v":0},"transfert modal",0.1,{"$f":"IF(E330=\"aucun des 4\",\"\",-E330*$K330*'USER TEC-Tec'!G243*SUM(L$322:L$323)*0.5)","v":""},{"$f":"-G330*$K330*SUM(M$322:M$323)*0.5","v":0},{"$f":"-H330*$K330*SUM(N$322:N$323)*0.5","v":{"$error":"#VALUE!"}},{"$f":"-I330*$K330*SUM(O$322:O$323)*0.5","v":0},null,null,null,null,"hyp."]
[null,null,null,"-"]
[null,null,null,{"$f":"D311","v":"aucun"},0,{"$f":"E332","v":0}]
[null,null,null,{"$f":"D312","v":"symboliques"},0.2,{"$f":"E333","v":0.2}]
[null,null,null,{"$f":"D313","v":"nombreux"},0.5,{"$f":"E334","v":0.5}]
[null,null,null,{"$f":"D314","v":"nombreux + pool de VE"},1,{"$f":"E335","v":1}]
[null,{"$f":"B315","v":"emplacements pour deux-roues"},null,{"$f":"'USER TEC-Tec'!D244","v":"-"},{"$f":"IF(D336=D338,E338,IF(D336=D339,E339,IF(D336=D340,E340,IF(D336=D341,E341,\"aucun des 4\"))))","v":"aucun des 4"},{"$f":"IF('USER TEC-Tec'!E244=D338,F338,IF('USER TEC-Tec'!E244=D339,F339,IF('USER TEC-Tec'!E244=D340,F340,IF('USER TEC-Tec'!E244=D341,F341,\"aucun des 4\"))))","v":"aucun des 4"},{"$f":"MAX(E338:E341)","v":1},{"$f":"F336","v":"aucun des 4"},{"$f":"MIN(E338:E341)","v":0},"transfert modal",0.3,{"$f":"IF(E336=\"aucun des 4\",\"\",-E336*$K336*'USER TEC-Tec'!G244*SUM(L$322:L$323)*0.9)","v":""},{"$f":"-G336*$K336*SUM(M$322:M$323)*0.9","v":0},{"$f":"-H336*$K336*SUM(N$322:N$323)*0.9","v":{"$error":"#VALUE!"}},{"$f":"-I336*$K336*SUM(O$322:O$323)*0.9","v":0},null,null,null,null,"hyp."]
[null,null,null,"-"]
[null,null,null,{"$f":"D317","v":"aucun"},0,{"$f":"E338","v":0}]
[null,null,null,{"$f":"D318","v":"abri mis en valeur"},0.5,{"$f":"E339","v":0.5}]
[null,null,null,{"$f":"D319","v":"local sécurisé et bornes élec."},0.8,{"$f":"E340","v":0.8}]
[null,null,null,{"$f":"D320","v":"local sécurisé et offre de VAE"},1,{"$f":"E341","v":1}]
[null,"Visiteurs",14,null,null,null,null,null,null,null,null,{"$f":"SUM(L343:L361)","v":0},{"$f":"SUM(M343:M361)","v":0},{"$f":"SUM(N343:N361)","v":{"$error":"#VALUE!"}},{"$f":"SUM(O343:O361)","v":0},{"$f":"(O342-M342)/$E$6*200","v":{"$error":"#DIV/0!"}},20,{"$f":"IF(L342=0,0,IF(L342>O342,0,IF(L342<M342,Q342,(1-(L342-$M342)/($O342-$M342))*$Q342)))","v":0},{"$f":"(1-(N342-$M342)/($O342-$M342))*$Q342","v":{"$error":"#VALUE!"}},"Valider l'effectif à SU/5"]
[null,"distance moyenne du trajet",null,"km aller",{"$f":"'USER TEC-Tec'!D247","v":0},{"$f":"'USER TEC-Tec'!E247","v":0},{"$f":"G322","v":1.6666666666666667},{"$f":"H322","v":4.333333333333333},{"$f":"I322","v":7},"kg CO2e / km aller",{"$f":"200*0.2*2","v":80},{"$f":"IF($F$299<>0,E343*$K343*'USER TEC-Tec'!G247/1000*E6/5*0.8*$E$299/$F$299,0)","v":0},{"$f":"IF($F$299<>0,G343*$K343/1000*G6/5*0.8*$E$299/$F$299,0)","v":0},{"$f":"IF($F$299<>0,H343*$K343/1000*H6/5*0.8*$E$299/$F$299,0)","v":0},{"$f":"IF($F$299<>0,I343*$K343/1000*I6/5*0.8*$E$299/$F$299,0)","v":0},null,null,null,null,"hyp. = scolaires"]
[null,{"$f":"B303","v":"disponibilité de transports en commun"},null,{"$f":"'USER TEC-Tec'!D248","v":"-"},{"$f":"IF(D344=D346,E346,IF(D344=D347,E347,IF(D344=D348,E348,IF(D344=D349,E349,\"aucun des 4\"))))","v":"aucun des 4"},{"$f":"IF('USER TEC-Tec'!E248=D346,F346,IF('USER TEC-Tec'!E248=D347,F347,IF('USER TEC-Tec'!E248=D348,F348,IF('USER TEC-Tec'!E248=D349,F349,\"aucun des 4\"))))","v":"aucun des 4"},{"$f":"MAX(E346:E349)","v":1},{"$f":"F344","v":"aucun des 4"},{"$f":"MIN(E346:E349)","v":0},"transfert modal",0.2,{"$f":"IF(E344=\"aucun des 4\",\"\",-E344*$K344*'USER TEC-Tec'!G248*SUM(L$343:L$343)*0.75)","v":""},{"$f":"-G344*$K344*SUM(M$343:M$343)*0.75","v":0},{"$f":"-H344*$K344*SUM(N$343:N$343)*0.75","v":{"$error":"#VALUE!"}},{"$f":"-I344*$K344*SUM(O$343:O$343)*0.75","v":0},null,null,null,null,"hyp."]
[null,null,null,"-"]
[null,null,null,"aucune",0,{"$f":"E346","v":0}]
[null,null,null,"faible",0.2,{"$f":"E347","v":0.2}]
[null,null,null,"une ligne à proximité",0.5,{"$f":"E348","v":0.5}]
[null,null,null,"maillage à proximité",1,{"$f":"E349","v":1}]
[null,{"$f":"B309","v":"emplacements de voitures électriques"},null,{"$f":"'USER TEC-Tec'!D249","v":"-"},{"$f":"IF(D350=D352,E352,IF(D350=D353,E353,IF(D350=D354,E354,IF(D350=D355,E355,\"aucun des 4\"))))","v":"aucun des 4"},{"$f":"IF('USER TEC-Tec'!E249=D352,F352,IF('USER TEC-Tec'!E249=D353,F353,IF('USER TEC-Tec'!E249=D354,F354,IF('USER TEC-Tec'!E249=D355,F355,\"aucun des 4\"))))","v":"aucun des 4"},{"$f":"MAX(E352:E355)","v":1},{"$f":"F350","v":"aucun des 4"},{"$f":"MIN(E352:E355)","v":0},"transfert modal",0.1,{"$f":"IF(E350=\"aucun des 4\",\"\",-E350*$K350*'USER TEC-Tec'!G249*SUM(L$343:L$343)*0.5)","v":""},{"$f":"-G350*$K350*SUM(M$343:M$343)*0.5","v":0},{"$f":"-H350*$K350*SUM(N$343:N$343)*0.5","v":{"$error":"#VALUE!"}},{"$f":"-I350*$K350*SUM(O$343:O$343)*0.5","v":0},null,null,null,null,"hyp."]
[null,null,null,"-"]
[null,null,null,{"$f":"D311","v":"aucun"},0,{"$f":"E352","v":0}]
[null,null,null,{"$f":"D312","v":"symboliques"},0.2,{"$f":"E353","v":0.2}]
[null,null,null,{"$f":"D313","v":"nombreux"},0.5,{"$f":"E354","v":0.5}]
[null,null,null,{"$f":"D314","v":"nombreux + pool de VE"},1,{"$f":"E355","v":1}]
[null,{"$f":"B315","v":"emplacements pour deux-roues"},null,{"$f":"'USER TEC-Tec'!D250","v":"-"},{"$f":"IF(D356=D358,E358,IF(D356=D359,E359,IF(D356=D360,E360,IF(D356=D361,E361,\"aucun des 4\"))))","v":"aucun des 4"},{"$f":"IF('USER TEC-Tec'!E250=D358,F358,IF('USER TEC-Tec'!E250=D359,F359,IF('USER TEC-Tec'!E250=D360,F360,IF('USER TEC-Tec'!E250=D361,F361,\"aucun des 4\"))))","v":"aucun des 4"},{"$f":"MAX(E358:E361)","v":1},{"$f":"F356","v":"aucun des 4"},{"$f":"MIN(E358:E361)","v":0},"transfert modal",0.2,{"$f":"IF(E356=\"aucun des 4\",\"\",-E356*$K356*'USER TEC-Tec'!G250*SUM(L$343:L$343)*0.9)","v":""},{"$f":"-G356*$K356*SUM(M$343:M$343)*0.9","v":0},{"$f":"-H356*$K356*SUM(N$343:N$343)*0.9","v":{"$error":"#VALUE!"}},{"$f":"-I356*$K356*SUM(O$343:O$343)*0.9","v":0},null,null,null,null,"hyp."]
[null,null,null,"-"]
[null,null,null,{"$f":"D317","v":"aucun"},0,{"$f":"E358","v":0}]
[null,null,null,{"$f":"D318","v":"abri mis en valeur"},0.5,{"$f":"E359","v":0.5}]
[null,null,null,{"$f":"D319","v":"local sécurisé et bornes élec."},0.8,{"$f":"E360","v":0.8}]
[null,null,null,{"$f":"D320","v":"local sécurisé et offre de VAE"},1,{"$f":"E361","v":1}]
[null,"Effectif quotidien"]
[null,"personnel",null,"%",{"$f":"IF($E5=$E400,F400,IF($E5=$E401,F401,IF($E5=$E402,F402,F403)))","v":0.05},{"$f":"E363","v":0.05},null,{"$f":"+E363","v":0.05},null,null,null,{"$f":"IF($F$299<>0,$E363*L300*$E$299/$F$299,0)","v":0},{"$f":"IF($F$299<>0,$E363*M300*$E$299/$F$299,0)","v":0},0,0,{"$f":"$E363*P300","v":{"$error":"#DIV/0!"}},{"$f":"$E363*Q300","v":1},{"$f":"$E363*R300","v":0},{"$f":"$E363*S300","v":{"$error":"#VALUE!"}}]
[null,"élèves ou étudiants",null,"%",{"$f":"IF($E5=$E400,G400,IF($E5=$E401,G401,IF($E5=$E402,G402,G403)))","v":0},{"$f":"E364","v":0},null,{"$f":"+E364","v":0},null,null,null,{"$f":"IF($F$299<>0,$E364*L321*$E$299/$F$299,0)","v":0},{"$f":"IF($F$299<>0,$E364*M321*$E$299/$F$299,0)","v":0},0,0,{"$f":"$E364*P321","v":{"$error":"#DIV/0!"}},{"$f":"$E364*Q321","v":0},{"$f":"$E364*R321","v":0},{"$f":"$E364*S321","v":{"$error":"#VALUE!"}}]
[null,"visiteurs",null,"%",{"$f":"IF($E5=$E400,H400,IF($E5=$E401,H401,IF($E5=$E402,H402,H403)))","v":0.95},{"$f":"E365","v":0.95},null,{"$f":"+E365","v":0.95},null,null,null,{"$f":"IF($F$299<>0,$E365*L342*$E$299/$F$299,0)","v":0},{"$f":"IF($F$299<>0,$E365*M342*$E$299/$F$299,0)","v":0},0,0,{"$f":"$E365*P342","v":{"$error":"#DIV/0!"}},{"$f":"$E365*Q342","v":19},{"$f":"$E365*R342","v":0},{"$f":"$E365*S342","v":{"$error":"#VALUE!"}}]
[null,null,null,null,null,null,null,null,null,null,{"$f":"A299","v":"Déplacements"},{"$f":"+SUM(L363:L365)","v":0},{"$f":"+SUM(M363:M365)","v":0},{"$f":"+SUM(N363:N365)","v":0},{"$f":"+SUM(O363:O365)","v":0},{"$f":"SUM(P363:P365)","v":{"$error":"#DIV/0!"}},{"$f":"SUM(Q363:Q365)","v":20},{"$f":"SUM(R363:R365)","v":0},{"$f":"SUM(S363:S365)","v":{"$error":"#VALUE!"}}]
[null,null,null,null,null,null,null,null,null,null,null,null,null,null,null,null,{"$f":"Q366*100/$Q$396","v":{"$error":"#DIV/0!"}},{"$f":"R366*100/$Q$396","v":{"$error":"#DIV/0!"}},{"$f":"S366*100/$Q$396","v":{"$error":"#VALUE!"}}]
["Autres services"]
[null,"Restauration du midi",15,"repas / jour",{"$f":"'USER TEC-Tec'!D255","v":0},{"$f":"'USER TEC-Tec'!E255","v":0},null,{"$f":"IF($E5=$E400,I400,IF($E5=$E401,I401,IF($E5=$E402,I402,I403)))*E6/1000","v":0},null,"repas moyen",{"$f":"IF($E5=$E400,J400,IF($E5=$E401,J401,IF($E5=$E402,J402,J403)))","v":2.27},{"$f":"SUM(L370:L375)","v":0},{"$f":"SUM(M370:M375)","v":0},{"$f":"SUM(N370:N375)","v":0},{"$f":"SUM(O370:O375)","v":0},{"$f":"(O369-M369)/$E$6*200","v":{"$error":"#DIV/0!"}},{"$f":"ROUND(E369*40/E$6+0.5,0)","v":{"$error":"#DIV/0!"}},{"$f":"IF(L369=0,0,IF(L369>O369,0,IF(L369<M369,Q369,(1-(L369-$M369)/($O369-$M369))*$Q369)))","v":0},{"$f":"(1-(N369-$M369)/($O369-$M369))*$Q369","v":{"$error":"#DIV/0!"}},"Supprimer la référence au nombre ?"]
[null,"apportée du domicile",null,"% des repas",{"$f":"'USER TEC-Tec'!D257","v":0},{"$f":"'USER TEC-Tec'!E257","v":0},0.15,{"$f":"(G370+2*I370)/3","v":0.18333333333333335},0.2,"kgCO2e / repas",{"$f":"0+0.6*0.9","v":0.54},{"$f":"E370*$E$369*250*$K370*'USER TEC-Tec'!G257/1000","v":0},{"$f":"G370*$H$369*250*$K370/1000","v":0},0,0,null,null,null,null,"Emballage recyclé + 0,6*0,9 (FE élec*conso élec)"]
[null,"livrée individuellement",null,"% des repas",{"$f":"'USER TEC-Tec'!D258","v":0},{"$f":"'USER TEC-Tec'!E258","v":0},0.15,{"$f":"(G371+2*I371)/3","v":0.3833333333333333},0.5,"kgCO2e / repas",{"$f":"0.5+0.6*0.9","v":1.04},{"$f":"E371*$E$369*250*$K371*'USER TEC-Tec'!G258/1000","v":0},0,0,0,null,null,null,null,"Emballage plastique + transport mutualisé + 0,6*0,9 (FE élec*conso élec)"]
[null,"de proximité à pieds",null,"% des repas",{"$f":"'USER TEC-Tec'!D259","v":0},{"$f":"'USER TEC-Tec'!E259","v":0},0,{"$f":"(G372+2*I372)/3","v":0.13333333333333333},0.2,"kgCO2e / repas",{"$f":"0+0.6*0.9","v":0.54},{"$f":"E372*$E$369*250*$K372*'USER TEC-Tec'!G259/1000","v":0},0,0,0,null,null,null,null,"+ 0,6*0,9 (FE élec*conso élec)"]
[null,"aux alentours en voiture",null,"% des repas",{"$f":"'USER TEC-Tec'!D260","v":0},{"$f":"'USER TEC-Tec'!E260","v":0},0,{"$f":"(G373+2*I373)/3","v":6.6666666666666666E-2},0.1,"kgCO2e / repas",{"$f":"1+0.6*0.9","v":1.54},{"$f":"E373*$E$369*250*$K373*'USER TEC-Tec'!G260/1000","v":0},0,0,0,null,null,null,null,"Hyp : 2 km à froid en voiture + 0,6*0,9 (FE élec*conso élec)"]
[null,"en cafétéria standard",null,"% des repas",{"$f":"'USER TEC-Tec'!D261","v":0},{"$f":"'USER TEC-Tec'!E261","v":0},0,0.2,0,"kgCO2e / repas",{"$f":"-0.2+IF(D223=\"liaison chaude\",0.65*0.6,IF(D223=\"liaison froide\",0.65*0.6,0))","v":-0.2},{"$f":"E374*$E$369*250*$K374*'USER TEC-Tec'!G261/1000","v":0},0,0,0,null,null,null,null,"Froid et cuisson estimés à 0,2 + conso élec si les repas sont livrés (liaison chaude ou froide)"]
[null,"en cafétéria bas carbone",null,"% des repas",{"$f":"'USER TEC-Tec'!D262","v":0},{"$f":"'USER TEC-Tec'!E262","v":0},{"$f":"1-SUM(G370:G374)","v":0.7},{"$f":"1-SUM(H370:H374)","v":3.3333333333333437E-2},{"$f":"1-SUM(I370:I374)","v":0},"kgCO2e / repas",{"$f":"-(K369-0.2)/2-0.2+IF(D223=\"liaison chaude\",0.65*0.6,IF(D223=\"liaison froide\",0.65*0.6,0))","v":-1.2349999999999999},{"$f":"E375*$E$369*250*$K375*'USER TEC-Tec'!G262/1000","v":0},0,0,0,null,null,null,null,"Repas moyen français 2,27  + conso élec si les repas sont livrés (liaison chaude ou froide)"]
[null,"Activité commerciale",16,null,{"$f":"SUM(E377:E378)","v":0},null,null,null,null,null,null,{"$f":"SUM(L377:L378)","v":0},{"$f":"SUM(M377:M378)","v":0},{"$f":"SUM(N377:N378)","v":0},{"$f":"SUM(O377:O378)","v":0},{"$f":"(O376-M376)/$E$6*200","v":{"$error":"#DIV/0!"}},{"$f":"ROUND(L376*180/E$6+0.5,0)","v":{"$error":"#DIV/0!"}},{"$f":"IF(O376=0,0,IF(L376>O376,0,IF(L376<M376,Q376,(1-(L376-$M376)/($O376-$M376))*$Q376)))","v":0},{"$f":"IF(O376=0,0,(1-(N376-$M376)/($O376-$M376))*$Q376)","v":0}]
[null,"surface de vente alimentaire",null,"m²",{"$f":"'USER TEC-Tec'!D265","v":0},{"$f":"IF(F6*F7=0,0,H377)","v":0},0,{"$f":"(G377+2*I377)/3","v":0},0,"kgCO2e / m²",{"$f":"3000*0.2","v":600},{"$f":"E377*$K377*'USER TEC-Tec'!G265/1000","v":0},{"$f":"G377*$K377/1000","v":0},0,0,null,null,null,null,"latitude produits ± 10 %"]
[null,"surface de vente non alimentaire",null,"m²",{"$f":"'USER TEC-Tec'!D266","v":0},{"$f":"IF(F7*F8=0,0,H378)","v":0},0,{"$f":"(G378+2*I378)/3","v":0},0,"kgCO2e / m²",{"$f":"1000*0.2","v":200},{"$f":"E378*$K378*'USER TEC-Tec'!G266/1000","v":0},0,0,0,null,null,null,null,"latitude produits ± 10 %"]
[null,"Adduction d'eau",17,null,null,null,null,null,null,null,null,{"$f":"SUM(L380:L381)","v":0},{"$f":"SUM(M380:M381)","v":0},{"$f":"SUM(N380:N381)","v":{"$error":"#VALUE!"}},{"$f":"SUM(O380:O381)","v":0},{"$f":"(O379-M379)/$E$6*200","v":{"$error":"#DIV/0!"}},0.5,{"$f":"IF(L379>O379,0,IF(L379<M379,Q379,(1-(L379-$M379)/($O379-$M379))*$Q379))","v":{"$error":"#DIV/0!"}},{"$f":"(1-(N379-$M379)/($O379-$M379))*$Q379","v":{"$error":"#VALUE!"}}]
[null,"consommation annuelle eau de réseau",null,"m³ / an",{"$f":"IF(E381=\"aucun des 3\",H380,H380*(1-E381))","v":0},{"$f":"IF(CODE('USER TEC-Tec'!E269)=101,H380,'USER TEC-Tec'!E269)","v":"0"},{"$f":"G6/2","v":0},{"$f":"(G380+2*I380)/3","v":0},{"$f":"I6*2","v":0},"kg CO2e / m³",0.2,{"$f":"E380*$K380*'USER TEC-Tec'!G269/1000","v":0},{"$f":"G380*$K380/1000","v":0},{"$f":"H380*$K380/1000","v":0},{"$f":"I380*$K380/1000","v":0}]
[null,"récupération et réutilisation d'eau pluviale",null,{"$f":"'USER TEC-Tec'!D270","v":"-"},{"$f":"IF(D381=D383,E383,IF(D381=D384,E384,IF(D381=D385,E385,\"aucun des 3\")))","v":"aucun des 3"},{"$f":"IF('USER TEC-Tec'!E270=D383,F383,IF('USER TEC-Tec'!E270=D384,F384,IF('USER TEC-Tec'!E270=D385,F385,\"aucun des 3\")))","v":"aucun des 3"},{"$f":"MAX(E383:E385)","v":0.8},{"$f":"F381","v":"aucun des 3"},{"$f":"MIN(E383:E385)","v":0},"kg CO2e / m³",0.05,{"$f":"IF(E381=\"aucun des 3\",\"\",E380*E381*($K381*'USER TEC-Tec'!G270-$K380*'USER TEC-Tec'!G269)/1000)","v":""},{"$f":"G380*G381*($K381-$K380)/1000","v":0},{"$f":"H380*H381*($K381-$K380)/1000","v":{"$error":"#VALUE!"}},{"$f":"I380*I381*($K381-$K380)/1000","v":0}]
[null,null,null,"-"]
[null,null,null,"non",0,{"$f":"E383","v":0}]
[null,null,null,"partielle",0.2,{"$f":"E384","v":0.2}]
[null,null,null,"totale",0.8,{"$f":"E385","v":0.8}]
[null,"Traitement des déchets",18,null,null,null,null,null,null,null,null,{"$f":"SUM(L387:L388)","v":0},{"$f":"SUM(M387:M388)","v":0},{"$f":"SUM(N387:N388)","v":{"$error":"#VALUE!"}},{"$f":"SUM(O387:O388)","v":0},{"$f":"(O386-M386)/$E$6*200","v":{"$error":"#DIV/0!"}},4.5,{"$f":"IF(L386>O386,0,IF(L386<M386,Q386,(1-(L386-$M386)/($O386-$M386))*$Q386))","v":{"$error":"#DIV/0!"}},{"$f":"(1-(N386-$M386)/($O386-$M386))*$Q386","v":{"$error":"#VALUE!"}}]
[null,"production annuelle",null,"tonnes / an",{"$f":"IF(CODE('USER TEC-Tec'!D273)=101,H387,'USER TEC-Tec'!D273)","v":0},{"$f":"IF(CODE('USER TEC-Tec'!E273)=101,H387,'USER TEC-Tec'!E273)","v":"0"},{"$f":"20*G6/1000","v":0},{"$f":"(G387+2*I387)/3","v":0},{"$f":"100*I6/1000","v":0},"kg CO2e / t",250,{"$f":"E387*$K387*'USER TEC-Tec'!G273/1000","v":0},{"$f":"G387*$K387/1000","v":0},{"$f":"H387*$K387/1000","v":0},{"$f":"I387*$K387/1000","v":0}]
[null,"tri sélectif",null,{"$f":"'USER TEC-Tec'!D274","v":"-"},{"$f":"IF(D388=D390,E390,IF(D388=D391,E391,IF(D388=D392,E392,\"aucun des 3\")))","v":"aucun des 3"},{"$f":"IF('USER TEC-Tec'!E274=D390,F390,IF('USER TEC-Tec'!E274=D391,F391,IF('USER TEC-Tec'!E274=D392,F392,\"aucun des 3\")))","v":"aucun des 3"},{"$f":"MAX(E390:E392)","v":0.8},{"$f":"F388","v":"aucun des 3"},{"$f":"MIN(E390:E392)","v":0},"kg CO2e / t",50,{"$f":"IF(E388=\"aucun des 3\",\"\",E387*E388*($K388*'USER TEC-Tec'!G274-$K387*'USER TEC-Tec'!G273)/1000)","v":""},{"$f":"G387*G388*($K388-$K387)/1000","v":0},{"$f":"H387*H388*($K388-$K387)/1000","v":{"$error":"#VALUE!"}},{"$f":"I387*I388*($K388-$K387)/1000","v":0}]
[null,null,null,"-"]
[null,null,null,"sans",0,{"$f":"E390","v":0}]
[null,null,null,"partiel",0.2,{"$f":"E391","v":0.2}]
[null,null,null,"total",0.8,{"$f":"E392","v":0.8}]
[null,null,null,null,null,null,null,null,null,null,{"$f":"A368","v":"Autres services"},{"$f":"L369+L376+L379+L386","v":0},{"$f":"M369+M376+M379+M386","v":0},{"$f":"N369+N376+N379+N386","v":{"$error":"#VALUE!"}},{"$f":"O369+O376+O379+O386","v":0},{"$f":"SUM(P369:P392)","v":{"$error":"#DIV/0!"}},{"$f":"SUM(Q369:Q392)","v":{"$error":"#DIV/0!"}},{"$f":"SUM(R369:R392)","v":{"$error":"#DIV/0!"}},{"$f":"SUM(S369:S392)","v":{"$error":"#DIV/0!"}}]
[null,null,null,null,null,null,null,null,null,null,null,null,null,null,null,null,{"$f":"Q393*100/$Q$396","v":{"$error":"#DIV/0!"}},{"$f":"R393*100/$Q$396","v":{"$error":"#DIV/0!"}},{"$f":"S393*100/$Q$396","v":{"$error":"#DIV/0!"}}]
["TOTAL"]
[null,null,null,null,null,null,null,null,null,null,"TOTAL de l'exploitation",{"$f":"IF(L296=\"\",0,L296+L366+L393)","v":0},{"$f":"M296+M366+M393","v":0},{"$f":"N296+N366+N393","v":{"$error":"#VALUE!"}},{"$f":"O296+O366+O393","v":{"$error":"#DIV/0!"}},{"$f":"P296+P366+P393","v":{"$error":"#DIV/0!"}},{"$f":"Q296+Q366+Q393+Q130","v":{"$error":"#DIV/0!"}},{"$f":"R296+R366+R393","v":{"$error":"#DIV/0!"}},{"$f":"S296+S366+S393","v":{"$error":"#VALUE!"}}]
[null,null,null,null,null,null,null,null,null,null,null,null,null,null,null,null,{"$f":"Q396*100/$Q$396","v":{"$error":"#DIV/0!"}},{"$f":"SUM(R394,R367,R297,R131)","v":{"$error":"#DIV/0!"}},{"$f":"SUM(S394,S367,S297,S131)","v":{"$error":"#DIV/0!"}}]
[null,null,null,null,null,"Répartition des déplacements",null,null,"Repas",null,"Conso. des prises de courant"]
[null,null,null,null,null,"personnel","élèves","visiteurs","nombre\npour 1000 m²","FE \ndu repas moyen","permanentes","intermittentes"]
[null,"type de bâtiment",null,null,"Immeuble de bureaux",0.9,0,0.1,50,2.2000000000000002,15,15]
[null,null,null,null,"Établissement scolaire",0.05,0.95,0,400,1.8,4,4]
[null,null,null,null,"Université",0.1,0.4,0.1,300,2,4,4]
[null,null,null,null,"Autre tertiaire",0.05,0,0.95,100,2.27,4,4]
[null,null,null,null,"-"]
[null,"Diagramme TEC-Tec",null,null,"Vert foncé","vert clair","jaune","orange","rouge","TEC-Tec"]
[null,null,null,null,20,20,20,20,20,{"$f":"'USER TEC-Tec'!D13","v":0}]
[null,null,null,null,0,0,0,0,0,0]
[]
[]
[]
[]
[]
[]
[null,null,null,null,0,0]
[null,null,null,null,0.01,0.01]
[null,null,null,null,0.02,0.02]
[null,null,null,null,0.03,0.03]
[null,null,null,null,0.04,0.04]
[null,null,null,null,0.05,0.05]
[null,null,null,null,0.06,0.06]
[null,null,null,null,7.0000000000000007E-2,7.0000000000000007E-2]
[null,null,null,null,0.08,0.08]
[null,null,null,null,0.09,0.09]
[null,null,null,null,0.1,0.1]
[null,null,null,null,0.11,0.11]
[null,null,null,null,0.12,0.12]
[null,null,null,null,0.13,0.13]
[null,null,null,null,0.14000000000000001,0.14000000000000001]
[null,null,null,null,0.15,0.15]
[null,null,null,null,0.16,0.16]
[null,null,null,null,0.17,0.17]
[null,null,null,null,0.18,0.18]
[null,null,null,null,0.19,0.19]
[null,null,null,null,0.2,0.2]
[null,null,null,null,0.21,0.21]
[null,null,null,null,0.22,0.22]
[null,null,null,null,0.23,0.23]
[null,null,null,null,0.24,0.24]
[null,null,null,null,0.25,0.25]
[null,null,null,null,0.26,0.26]
[null,null,null,null,0.27,0.27]
[null,null,null,null,0.28000000000000003,0.28000000000000003]
[null,null,null,null,0.28999999999999998,0.28999999999999998]
[null,null,null,null,0.3,0.3]
[null,null,null,null,0.31,0.31]
[null,null,null,null,0.32,0.32]
[null,null,null,null,0.33,0.33]
[null,null,null,null,0.34,0.34]
[null,null,null,null,0.35,0.35]
[null,null,null,null,0.36,0.36]
[null,null,null,null,0.37,0.37]
[null,null,null,null,0.38,0.38]
[null,null,null,null,0.39,0.39]
[null,null,null,null,0.4,0.4]
[null,null,null,null,0.41,0.41]
[null,null,null,null,0.42,0.42]
[null,null,null,null,0.43,0.43]
[null,null,null,null,0.44,0.44]
[null,null,null,null,0.45,0.45]
[null,null,null,null,0.46,0.46]
[null,null,null,null,0.47,0.47]
[null,null,null,null,0.48,0.48]
[null,null,null,null,0.49,0.49]
[null,null,null,null,0.5,0.5]
[null,null,null,null,0.51,0.51]
[null,null,null,null,0.52,0.52]
[null,null,null,null,0.53,0.53]
[null,null,null,null,0.54,0.54]
[null,null,null,null,0.55000000000000004,0.55000000000000004]
[null,null,null,null,0.56000000000000005,0.56000000000000005]
[null,null,null,null,0.56999999999999995,0.56999999999999995]
[null,null,null,null,0.57999999999999996,0.57999999999999996]
[null,null,null,null,0.59,0.59]
[null,null,null,null,0.6,0.6]
[null,null,null,null,0.61,0.61]
[null,null,null,null,0.62,0.62]
[null,null,null,null,0.63,0.63]
[null,null,null,null,0.64,0.64]
[null,null,null,null,0.65,0.65]
[null,null,null,null,0.66,0.66]
[null,null,null,null,0.67,0.67]
[null,null,null,null,0.68,0.68]
[null,null,null,null,0.69,0.69]
[null,null,null,null,0.7,0.7]
[null,null,null,null,0.71,0.71]
[null,null,null,null,0.72,0.72]
[null,null,null,null,0.73,0.73]
[null,null,null,null,0.74,0.74]
[null,null,null,null,0.75,0.75]
[null,null,null,null,0.76,0.76]
[null,null,null,null,0.77,0.77]
[null,null,null,null,0.78,0.78]
[null,null,null,null,0.79,0.79]
[null,null,null,null,0.8,0.8]
[null,null,null,null,0.81,0.81]
[null,null,null,null,0.82,0.82]
[null,null,null,null,0.83,0.83]
[null,null,null,null,0.84,0.84]
[null,null,null,null,0.85,0.85]
[null,null,null,null,0.86,0.86]
[null,null,null,null,0.87,0.87]
[null,null,null,null,0.88,0.88]
[null,null,null,null,0.89,0.89]
[null,null,null,null,0.9,0.9]
[null,null,null,null,0.91,0.91]
[null,null,null,null,0.92,0.92]
[null,null,null,null,0.93,0.93]
[null,null,null,null,0.94,0.94]
[null,null,null,null,0.95,0.95]
[null,null,null,null,0.96,0.96]
[null,null,null,null,0.97,0.97]
[null,null,null,null,0.98,0.98]
[null,null,null,null,0.99,0.99]
[null,null,null,null,1,1]

{"sheet":"JAUGE TEC-Tec","index":2,"n_rows":60,"n_cols":21,"rows_kept":60,"cut":false,"hidden":true,"merged":[[15,8,17,8]]}
[]
[null,null,"NOTE EVALUATION GLOBALE",null,null,null,null,null,null,null,null,null,null,null,null,"DIAGRAMME DE REPARTITION "]
[null,null,null,null,null,null,null,null,null,null,"Coef "]
[null,null,null,null,null,null,null,null,{"$f":"'USER TEC-Tec'!D13","v":0},"/100",{"$f":"I4","v":0},null,null,null,null,"CHANTIER ",{"$f":"'USER TEC-Tec'!D32","v":0}]
[null,null,null,null,null,null,null,null,null,null,null,null,null,null,null,"ENERGIE ",{"$f":"'USER TEC-Tec'!D144","v":0}]
[null,null,null,null,null,null,null,null,"EVAL","NOTES",null,null,null,null,null,"DEPLACEMENTS ",{"$f":"'USER TEC-Tec'!D228","v":0}]
[null,null,null,null,null,null,null,null,0.2,{"$f":"J10","v":0},null,{"$f":"+J7","v":0},null,null,null,"AUTRES SERVICES",{"$f":"'USER TEC-Tec'!D252","v":0}]
[null,null,null,null,null,null,null,null,0.2,{"$f":"(1-J7)","v":1},null,0.21," taille d'image fixe !!!"]
[null,null,null,null,null,null,null,null,0.2,{"$f":"(K4)/100","v":0},null,{"$f":"100%-L7","v":1},null,null,null,"TOTAL ",{"$f":"SUM(Q4:Q7)","v":0}]
[null,null,null,null,null,null,null,null,0.2,{"$f":"J9","v":0}]
[null,null,null,null,null,null,null,null,0.2]
[null,null,null,null,null,null,null,null,0.2]
[]
[null,null,null,null,null,null,null,null,"SEUILS ","Seuil 1","Seuil 2","Seuil 3","Seuil 4","Seuil 5"]
[null,null,null,null,null,null,null,null,"NOTES ","0-20","20-40","40-60","60-80","80-100"]
[null,null,null,null,null,null,null,null,"% de  référence ",0,17,33,50,67]
[null,null,null,null,null,null,null,null,null,{"$f":"AVERAGE(J18,J16)","v":8.5},{"$f":"AVERAGE(K18,K16)","v":25},{"$f":"AVERAGE(L18,L16)","v":41.5},{"$f":"AVERAGE(M18,M16)","v":58.5},{"$f":"AVERAGE(N18,N16)","v":75}]
[null,null,null,null,null,null,null,null,null,17,33,50,67,83]
[]
[null,null,"NOTE EVALUATION CHANTIER"]
[]
[null,null,null,null,null,null,null,null,{"$f":"'USER TEC-Tec'!D32","v":0},{"$f":"IF(ISERROR('BASE TEC-Tec'!Q131),1,'BASE TEC-Tec'!Q131)","v":1},{"$f":"I22*M22","v":0},{"$f":"100/J22","v":100},{"$f":"0.95*L22","v":95}]
[]
[null,null,null,null,null,null,null,null,"EVAL","NOTES"]
[null,null,null,null,null,null,null,null,0.2,{"$f":"J28","v":0},null,{"$f":"+J25","v":0}]
[null,null,null,null,null,null,null,null,0.2,{"$f":"(1-J25)","v":1},null,0.3," taille d'image fixe !!!"]
[null,null,null,null,null,null,null,null,0.2,{"$f":"(K22)/100","v":0},null,{"$f":"100%-L25","v":1}]
[null,null,null,null,null,null,null,null,0.2,{"$f":"J27","v":0}]
[null,null,null,null,null,null,null,null,0.2]
[null,null,null,null,null,null,null,null,0.2]
[]
[]
[]
[]
[]
[null,null,"NOTE EVALUATION ENERGIE",null,null,null,null,null,null,null,null,null,null,null,null,null,{"$f":"IF('BASE TEC-Tec'!E281=0,0,'BASE TEC-Tec'!R281)","v":0},"Prod Elec "]
[null,null,null,null,null,null,null,null,null,"valeur max",null,null,null,null,null,null,null,"valeur max"]
[null,null,null,null,null,null,null,null,{"$f":"'USER TEC-Tec'!D144","v":0},{"$f":"IF(ISERROR('BASE TEC-Tec'!Q297),1,'BASE TEC-Tec'!Q297)","v":1},{"$f":"I38*M38","v":0},{"$f":"100/J38","v":100},{"$f":"0.95*L38","v":95},null,null,null,{"$f":"+IF(ISERROR('BASE TEC-Tec'!R298),0,'BASE TEC-Tec'!R298)","v":0},{"$f":"+J38","v":1},{"$f":"Q38*U38","v":0},{"$f":"100/R38","v":100},{"$f":"0.95*T38","v":95}]
[]
[null,null,null,null,null,null,null,null,"EVAL","NOTES",null,null,null,null,null,null,"EVAL","NOTES"]
[null,null,null,null,null,null,null,null,0.2,{"$f":"J44","v":0},null,{"$f":"+J41","v":0},null,null,{"$f":"+R41","v":0},null,0.2,{"$f":"R44","v":0}]
[null,null,null,null,null,null,null,null,0.2,{"$f":"(1-J41)","v":1},null,0.19," taille d'image fixe !!!",null,0.11,null,0.2,{"$f":"(1-R41)","v":1}]
[null,null,null,null,null,null,null,null,0.2,{"$f":"(K38)/100","v":0},null,{"$f":"100%-L41","v":1},null,null,{"$f":"100%-O41","v":1},null,0.2,{"$f":"(S38)/100","v":0}]
[null,null,null,null,null,null,null,null,0.2,{"$f":"J43","v":0},null,null,null,null,null,null,0.2,{"$f":"R43","v":0}]
[null,null,null,null,null,null,null,null,0.2,null,null,null,null,null,null,null,0.2]
[null,null,null,null,null,null,null,null,0.2,null,null,null,null,null,null,null,0.2]
[]
[]
[]
[null,null,"NOTE EVALUATION DEPLACEMENT"]
[null,null,null,null,null,null,null,null,null,"valeur max"]
[null,null,null,null,null,null,null,null,{"$f":"'USER TEC-Tec'!D228","v":0},{"$f":"IF(ISERROR('BASE TEC-Tec'!Q367),1,'BASE TEC-Tec'!Q367)","v":1},{"$f":"I52*M52","v":0},{"$f":"100/J52","v":100},{"$f":"0.95*L52","v":95}]
[]
[null,null,null,null,null,null,null,null,"EVAL","NOTES"]
[null,null,null,null,null,null,null,null,0.2,{"$f":"J58","v":0},null,{"$f":"+J55","v":0}]
[null,null,null,null,null,null,null,null,0.2,{"$f":"(1-J55)","v":1},null,0.24," taille d'image fixe !!!"]
[null,null,null,null,null,null,null,null,0.2,{"$f":"(K52)/100","v":0},null,{"$f":"100%-L55","v":1}]
[null,null,null,null,null,null,null,null,0.2,{"$f":"J57","v":0}]
[null,null,null,null,null,null,null,null,0.2]
[null,null,null,null,null,null,null,null,0.2]

{"sheet":"CHARTE TEC-Tec","index":3,"n_rows":0,"n_cols":0,"rows_kept":0,"cut":false,"hidden":true,"merged":[]}

{"sheet":"Facteurs de calcul","index":4,"n_rows":315,"n_cols":7,"rows_kept":315,"cut":false,"hidden":false,"merged":[[309,1,309,3],[309,5,309,6]]}
["Facteurs de calcul de TEC-Tec"]
[null,{"$f":"'BASE TEC-Tec'!J3","v":"Unité"},{"$f":"'BASE TEC-Tec'!K3","v":"Valeur"}]
["CONSTRUCTION"]
[{"$f":"'BASE TEC-Tec'!B19","v":"Conception"},{"$f":"IF('BASE TEC-Tec'!J19=\"\",\"\",'BASE TEC-Tec'!J19)","v":""},{"$f":"IF('BASE TEC-Tec'!K19=\"\",\"\",'BASE TEC-Tec'!K19)","v":""}]
[{"$f":"'BASE TEC-Tec'!B20","v":"trajets entre La Réunion et la métropole"},{"$f":"IF('BASE TEC-Tec'!J20=\"\",\"\",'BASE TEC-Tec'!J20)","v":"kg CO2e / ARM"},{"$f":"IF('BASE TEC-Tec'!K20=\"\",\"\",'BASE TEC-Tec'!K20)","v":4000}]
[{"$f":"'BASE TEC-Tec'!B22","v":"Changement d'affectation des sols"},{"$f":"IF('BASE TEC-Tec'!J22=\"\",\"\",'BASE TEC-Tec'!J22)","v":""},{"$f":"IF('BASE TEC-Tec'!K22=\"\",\"\",'BASE TEC-Tec'!K22)","v":""}]
[{"$f":"'BASE TEC-Tec'!B23","v":"artificialisation nette"},{"$f":"IF('BASE TEC-Tec'!J23=\"\",\"\",'BASE TEC-Tec'!J23)","v":"kgCO2e / m²"},{"$f":"IF('BASE TEC-Tec'!K23=\"\",\"\",'BASE TEC-Tec'!K23)","v":20}]
[{"$f":"'BASE TEC-Tec'!B24","v":"Voirie et traitement paysager"},{"$f":"IF('BASE TEC-Tec'!J24=\"\",\"\",'BASE TEC-Tec'!J24)","v":""},{"$f":"IF('BASE TEC-Tec'!K24=\"\",\"\",'BASE TEC-Tec'!K24)","v":""}]
[{"$f":"'BASE TEC-Tec'!B25","v":"végétalisation (toiture végétalisée inclue)"},{"$f":"IF('BASE TEC-Tec'!J25=\"\",\"\",'BASE TEC-Tec'!J25)","v":"kgCO2e / m²"},{"$f":"IF('BASE TEC-Tec'!K25=\"\",\"\",'BASE TEC-Tec'!K25)","v":-10}]
[{"$f":"'BASE TEC-Tec'!B26","v":"enrobé neuf"},{"$f":"IF('BASE TEC-Tec'!J26=\"\",\"\",'BASE TEC-Tec'!J26)","v":"kgCO2e / m²"},{"$f":"IF('BASE TEC-Tec'!K26=\"\",\"\",'BASE TEC-Tec'!K26)","v":60}]
[{"$f":"'BASE TEC-Tec'!B27","v":"dallage en béton"},{"$f":"IF('BASE TEC-Tec'!J27=\"\",\"\",'BASE TEC-Tec'!J27)","v":"kgCO2e / m²"},{"$f":"IF('BASE TEC-Tec'!K27=\"\",\"\",'BASE TEC-Tec'!K27)","v":60}]
[{"$f":"'BASE TEC-Tec'!B28","v":"pavage béton enherbé"},{"$f":"IF('BASE TEC-Tec'!J28=\"\",\"\",'BASE TEC-Tec'!J28)","v":"kgCO2e / m²"},{"$f":"IF('BASE TEC-Tec'!K28=\"\",\"\",'BASE TEC-Tec'!K28)","v":25}]
[{"$f":"'BASE TEC-Tec'!B29","v":"enrobé neuf"},{"$f":"IF('BASE TEC-Tec'!J29=\"\",\"\",'BASE TEC-Tec'!J29)","v":"kgCO2e / m²"},{"$f":"IF('BASE TEC-Tec'!K29=\"\",\"\",'BASE TEC-Tec'!K29)","v":40}]
[{"$f":"'BASE TEC-Tec'!B30","v":"dallage en béton"},{"$f":"IF('BASE TEC-Tec'!J30=\"\",\"\",'BASE TEC-Tec'!J30)","v":"kgCO2e / m²"},{"$f":"IF('BASE TEC-Tec'!K30=\"\",\"\",'BASE TEC-Tec'!K30)","v":50}]
[{"$f":"'BASE TEC-Tec'!B31","v":"matériau perméable"},{"$f":"IF('BASE TEC-Tec'!J31=\"\",\"\",'BASE TEC-Tec'!J31)","v":"kgCO2e / m²"},{"$f":"IF('BASE TEC-Tec'!K31=\"\",\"\",'BASE TEC-Tec'!K31)","v":20}]
[{"$f":"'BASE TEC-Tec'!B32","v":"murets maçonnés"},{"$f":"IF('BASE TEC-Tec'!J32=\"\",\"\",'BASE TEC-Tec'!J32)","v":"kgCO2e / m²"},{"$f":"IF('BASE TEC-Tec'!K32=\"\",\"\",'BASE TEC-Tec'!K32)","v":200}]
[{"$f":"'BASE TEC-Tec'!B33","v":"mur de soutènement"},{"$f":"IF('BASE TEC-Tec'!J33=\"\",\"\",'BASE TEC-Tec'!J33)","v":"kgCO2e / m²"},{"$f":"IF('BASE TEC-Tec'!K33=\"\",\"\",'BASE TEC-Tec'!K33)","v":40}]
[{"$f":"'BASE TEC-Tec'!B36","v":"Fondations"},{"$f":"IF('BASE TEC-Tec'!J36=\"\",\"\",'BASE TEC-Tec'!J36)","v":""},{"$f":"IF('BASE TEC-Tec'!K36=\"\",\"\",'BASE TEC-Tec'!K36)","v":""}]
[{"$f":"'BASE TEC-Tec'!B37","v":"terrassements généraux"},{"$f":"IF('BASE TEC-Tec'!J37=\"\",\"\",'BASE TEC-Tec'!J37)","v":"kg CO2e / m³"},{"$f":"IF('BASE TEC-Tec'!K37=\"\",\"\",'BASE TEC-Tec'!K37)","v":10}]
[{"$f":"'BASE TEC-Tec'!B38","v":"nivellement dans la roche"},{"$f":"IF('BASE TEC-Tec'!J38=\"\",\"\",'BASE TEC-Tec'!J38)","v":"kg CO2e / m³"},{"$f":"IF('BASE TEC-Tec'!K38=\"\",\"\",'BASE TEC-Tec'!K38)","v":10}]
[{"$f":"'BASE TEC-Tec'!D41","v":"sans "},"m",{"$f":"'BASE TEC-Tec'!E41","v":0}]
[{"$f":"'BASE TEC-Tec'!D42","v":"moins d'un mètre"},"m",{"$f":"'BASE TEC-Tec'!E42","v":0.66666666666666663}]
[{"$f":"'BASE TEC-Tec'!D43","v":"environ deux mètres"},"m",{"$f":"'BASE TEC-Tec'!E43","v":2}]
[{"$f":"'BASE TEC-Tec'!B44","v":"pieux béton"},{"$f":"IF('BASE TEC-Tec'!J44=\"\",\"\",'BASE TEC-Tec'!J44)","v":"kgCO2e / m²"},{"$f":"IF('BASE TEC-Tec'!K44=\"\",\"\",'BASE TEC-Tec'!K44)","v":36}]
[{"$f":"'BASE TEC-Tec'!B45","v":"micropieux"},{"$f":"IF('BASE TEC-Tec'!J45=\"\",\"\",'BASE TEC-Tec'!J45)","v":"kgCO2e / m²"},{"$f":"IF('BASE TEC-Tec'!K45=\"\",\"\",'BASE TEC-Tec'!K45)","v":24}]
[{"$f":"'BASE TEC-Tec'!B46","v":"radier"},{"$f":"IF('BASE TEC-Tec'!J46=\"\",\"\",'BASE TEC-Tec'!J46)","v":"kgCO2e / m²"},{"$f":"IF('BASE TEC-Tec'!K46=\"\",\"\",'BASE TEC-Tec'!K46)","v":60}]
[{"$f":"'BASE TEC-Tec'!B47","v":"superficielles"},{"$f":"IF('BASE TEC-Tec'!J47=\"\",\"\",'BASE TEC-Tec'!J47)","v":"kgCO2e / m²"},{"$f":"IF('BASE TEC-Tec'!K47=\"\",\"\",'BASE TEC-Tec'!K47)","v":18}]
[{"$f":"'BASE TEC-Tec'!B48","v":"Infrastructure"},{"$f":"IF('BASE TEC-Tec'!J48=\"\",\"\",'BASE TEC-Tec'!J48)","v":""},{"$f":"IF('BASE TEC-Tec'!K48=\"\",\"\",'BASE TEC-Tec'!K48)","v":""}]
[{"$f":"'BASE TEC-Tec'!B49","v":"sous-sols"},{"$f":"IF('BASE TEC-Tec'!J49=\"\",\"\",'BASE TEC-Tec'!J49)","v":"kgCO2e / m²"},{"$f":"IF('BASE TEC-Tec'!K49=\"\",\"\",'BASE TEC-Tec'!K49)","v":144}]
[{"$f":"'BASE TEC-Tec'!B50","v":"plus-value poutres de reprise"},{"$f":"IF('BASE TEC-Tec'!J50=\"\",\"\",'BASE TEC-Tec'!J50)","v":"kgCO2e / m²"},{"$f":"IF('BASE TEC-Tec'!K50=\"\",\"\",'BASE TEC-Tec'!K50)","v":35}]
[{"$f":"'BASE TEC-Tec'!B51","v":"Planchers"},{"$f":"IF('BASE TEC-Tec'!J51=\"\",\"\",'BASE TEC-Tec'!J51)","v":""},{"$f":"IF('BASE TEC-Tec'!K51=\"\",\"\",'BASE TEC-Tec'!K51)","v":""}]
[{"$f":"'BASE TEC-Tec'!B52","v":"béton"},{"$f":"IF('BASE TEC-Tec'!J52=\"\",\"\",'BASE TEC-Tec'!J52)","v":"kgCO2e / m²"},{"$f":"IF('BASE TEC-Tec'!K52=\"\",\"\",'BASE TEC-Tec'!K52)","v":90}]
[{"$f":"'BASE TEC-Tec'!B53","v":"collaborant métal-béton"},{"$f":"IF('BASE TEC-Tec'!J53=\"\",\"\",'BASE TEC-Tec'!J53)","v":"kgCO2e / m²"},{"$f":"IF('BASE TEC-Tec'!K53=\"\",\"\",'BASE TEC-Tec'!K53)","v":120}]
[{"$f":"'BASE TEC-Tec'!B54","v":"collaborant bois-béton"},{"$f":"IF('BASE TEC-Tec'!J54=\"\",\"\",'BASE TEC-Tec'!J54)","v":"kgCO2e / m²"},{"$f":"IF('BASE TEC-Tec'!K54=\"\",\"\",'BASE TEC-Tec'!K54)","v":0}]
[{"$f":"'BASE TEC-Tec'!B55","v":"ossature et platelage bois"},{"$f":"IF('BASE TEC-Tec'!J55=\"\",\"\",'BASE TEC-Tec'!J55)","v":"kgCO2e / m²"},{"$f":"IF('BASE TEC-Tec'!K55=\"\",\"\",'BASE TEC-Tec'!K55)","v":-20}]
[{"$f":"'BASE TEC-Tec'!B56","v":"bois plein (CLT)"},{"$f":"IF('BASE TEC-Tec'!J56=\"\",\"\",'BASE TEC-Tec'!J56)","v":"kgCO2e / m²"},{"$f":"IF('BASE TEC-Tec'!K56=\"\",\"\",'BASE TEC-Tec'!K56)","v":-80}]
[{"$f":"'BASE TEC-Tec'!B57","v":"Ossature principale"},{"$f":"IF('BASE TEC-Tec'!J57=\"\",\"\",'BASE TEC-Tec'!J57)","v":""},{"$f":"IF('BASE TEC-Tec'!K57=\"\",\"\",'BASE TEC-Tec'!K57)","v":""}]
[{"$f":"'BASE TEC-Tec'!B58","v":"voiles de refend en béton"},{"$f":"IF('BASE TEC-Tec'!J58=\"\",\"\",'BASE TEC-Tec'!J58)","v":"kgCO2e / m²"},{"$f":"IF('BASE TEC-Tec'!K58=\"\",\"\",'BASE TEC-Tec'!K58)","v":71.400000000000006}]
[{"$f":"'BASE TEC-Tec'!B59","v":"murs en matériaux locaux"},{"$f":"IF('BASE TEC-Tec'!J59=\"\",\"\",'BASE TEC-Tec'!J59)","v":"kgCO2e / m²"},{"$f":"IF('BASE TEC-Tec'!K59=\"\",\"\",'BASE TEC-Tec'!K59)","v":15}]
[{"$f":"'BASE TEC-Tec'!B60","v":"ossature béton"},{"$f":"IF('BASE TEC-Tec'!J60=\"\",\"\",'BASE TEC-Tec'!J60)","v":"kgCO2e / m²"},{"$f":"IF('BASE TEC-Tec'!K60=\"\",\"\",'BASE TEC-Tec'!K60)","v":21}]
[{"$f":"'BASE TEC-Tec'!B61","v":"ossature métal"},{"$f":"IF('BASE TEC-Tec'!J61=\"\",\"\",'BASE TEC-Tec'!J61)","v":"kgCO2e / m²"},{"$f":"IF('BASE TEC-Tec'!K61=\"\",\"\",'BASE TEC-Tec'!K61)","v":36}]
[{"$f":"'BASE TEC-Tec'!B62","v":"ossature bois"},{"$f":"IF('BASE TEC-Tec'!J62=\"\",\"\",'BASE TEC-Tec'!J62)","v":"kgCO2e / m²"},{"$f":"IF('BASE TEC-Tec'!K62=\"\",\"\",'BASE TEC-Tec'!K62)","v":-15}]
[{"$f":"'BASE TEC-Tec'!B63","v":"bois massif (CLT)"},{"$f":"IF('BASE TEC-Tec'!J63=\"\",\"\",'BASE TEC-Tec'!J63)","v":"kgCO2e / m²"},{"$f":"IF('BASE TEC-Tec'!K63=\"\",\"\",'BASE TEC-Tec'!K63)","v":-30}]
[{"$f":"'BASE TEC-Tec'!B64","v":"Remplissage de façade"},{"$f":"IF('BASE TEC-Tec'!J64=\"\",\"\",'BASE TEC-Tec'!J64)","v":""},{"$f":"IF('BASE TEC-Tec'!K64=\"\",\"\",'BASE TEC-Tec'!K64)","v":""}]
[{"$f":"'BASE TEC-Tec'!B65","v":"voiles béton"},{"$f":"IF('BASE TEC-Tec'!J65=\"\",\"\",'BASE TEC-Tec'!J65)","v":"kgCO2e / m²"},{"$f":"IF('BASE TEC-Tec'!K65=\"\",\"\",'BASE TEC-Tec'!K65)","v":70}]
[{"$f":"'BASE TEC-Tec'!B66","v":"maçonnerie"},{"$f":"IF('BASE TEC-Tec'!J66=\"\",\"\",'BASE TEC-Tec'!J66)","v":"kgCO2e / m²"},{"$f":"IF('BASE TEC-Tec'!K66=\"\",\"\",'BASE TEC-Tec'!K66)","v":35}]
[{"$f":"'BASE TEC-Tec'!B67","v":"métallique"},{"$f":"IF('BASE TEC-Tec'!J67=\"\",\"\",'BASE TEC-Tec'!J67)","v":"kgCO2e / m²"},{"$f":"IF('BASE TEC-Tec'!K67=\"\",\"\",'BASE TEC-Tec'!K67)","v":80}]
[{"$f":"'BASE TEC-Tec'!B68","v":"mur en terre"},{"$f":"IF('BASE TEC-Tec'!J68=\"\",\"\",'BASE TEC-Tec'!J68)","v":"kgCO2e / m²"},{"$f":"IF('BASE TEC-Tec'!K68=\"\",\"\",'BASE TEC-Tec'!K68)","v":5}]
[{"$f":"'BASE TEC-Tec'!B69","v":"ossature bois"},{"$f":"IF('BASE TEC-Tec'!J69=\"\",\"\",'BASE TEC-Tec'!J69)","v":"kgCO2e / m²"},{"$f":"IF('BASE TEC-Tec'!K69=\"\",\"\",'BASE TEC-Tec'!K69)","v":-15}]
[{"$f":"'BASE TEC-Tec'!B70","v":"mur rideau acier et aluminium"},{"$f":"IF('BASE TEC-Tec'!J70=\"\",\"\",'BASE TEC-Tec'!J70)","v":"kgCO2e / m²"},{"$f":"IF('BASE TEC-Tec'!K70=\"\",\"\",'BASE TEC-Tec'!K70)","v":130}]
[{"$f":"'BASE TEC-Tec'!B71","v":"châssis acier vitré"},{"$f":"IF('BASE TEC-Tec'!J71=\"\",\"\",'BASE TEC-Tec'!J71)","v":"kgCO2e / m²"},{"$f":"IF('BASE TEC-Tec'!K71=\"\",\"\",'BASE TEC-Tec'!K71)","v":115}]
[{"$f":"'BASE TEC-Tec'!B72","v":"châssis aluminium vitré"},{"$f":"IF('BASE TEC-Tec'!J72=\"\",\"\",'BASE TEC-Tec'!J72)","v":"kgCO2e / m²"},{"$f":"IF('BASE TEC-Tec'!K72=\"\",\"\",'BASE TEC-Tec'!K72)","v":105}]
[{"$f":"'BASE TEC-Tec'!B73","v":"châssis PVC vitré"},{"$f":"IF('BASE TEC-Tec'!J73=\"\",\"\",'BASE TEC-Tec'!J73)","v":"kgCO2e / m²"},{"$f":"IF('BASE TEC-Tec'!K73=\"\",\"\",'BASE TEC-Tec'!K73)","v":85}]
[{"$f":"'BASE TEC-Tec'!B74","v":"châssis bois vitré"},{"$f":"IF('BASE TEC-Tec'!J74=\"\",\"\",'BASE TEC-Tec'!J74)","v":"kgCO2e / m²"},{"$f":"IF('BASE TEC-Tec'!K74=\"\",\"\",'BASE TEC-Tec'!K74)","v":40}]
[{"$f":"'BASE TEC-Tec'!B75","v":"Revêtement de façade"},{"$f":"IF('BASE TEC-Tec'!J75=\"\",\"\",'BASE TEC-Tec'!J75)","v":""},{"$f":"IF('BASE TEC-Tec'!K75=\"\",\"\",'BASE TEC-Tec'!K75)","v":""}]
[{"$f":"'BASE TEC-Tec'!B76","v":"peinture"},{"$f":"IF('BASE TEC-Tec'!J76=\"\",\"\",'BASE TEC-Tec'!J76)","v":"kgCO2e / m²"},{"$f":"IF('BASE TEC-Tec'!K76=\"\",\"\",'BASE TEC-Tec'!K76)","v":1}]
[{"$f":"'BASE TEC-Tec'!B77","v":"enduit"},{"$f":"IF('BASE TEC-Tec'!J77=\"\",\"\",'BASE TEC-Tec'!J77)","v":"kgCO2e / m²"},{"$f":"IF('BASE TEC-Tec'!K77=\"\",\"\",'BASE TEC-Tec'!K77)","v":8}]
[{"$f":"'BASE TEC-Tec'!B78","v":"briquette ou pierre"},{"$f":"IF('BASE TEC-Tec'!J78=\"\",\"\",'BASE TEC-Tec'!J78)","v":"kgCO2e / m²"},{"$f":"IF('BASE TEC-Tec'!K78=\"\",\"\",'BASE TEC-Tec'!K78)","v":20}]
[{"$f":"'BASE TEC-Tec'!B79","v":"panneaux minéraux"},{"$f":"IF('BASE TEC-Tec'!J79=\"\",\"\",'BASE TEC-Tec'!J79)","v":"kgCO2e / m²"},{"$f":"IF('BASE TEC-Tec'!K79=\"\",\"\",'BASE TEC-Tec'!K79)","v":45}]
[{"$f":"'BASE TEC-Tec'!B80","v":"bardage acier"},{"$f":"IF('BASE TEC-Tec'!J80=\"\",\"\",'BASE TEC-Tec'!J80)","v":"kgCO2e / m²"},{"$f":"IF('BASE TEC-Tec'!K80=\"\",\"\",'BASE TEC-Tec'!K80)","v":35}]
[{"$f":"'BASE TEC-Tec'!B81","v":"bardage aluminium"},{"$f":"IF('BASE TEC-Tec'!J81=\"\",\"\",'BASE TEC-Tec'!J81)","v":"kgCO2e / m²"},{"$f":"IF('BASE TEC-Tec'!K81=\"\",\"\",'BASE TEC-Tec'!K81)","v":80}]
[{"$f":"'BASE TEC-Tec'!B82","v":"bardage bois"},{"$f":"IF('BASE TEC-Tec'!J82=\"\",\"\",'BASE TEC-Tec'!J82)","v":"kgCO2e / m²"},{"$f":"IF('BASE TEC-Tec'!K82=\"\",\"\",'BASE TEC-Tec'!K82)","v":0}]
[{"$f":"'BASE TEC-Tec'!B83","v":"Protections solaires extérieures"},{"$f":"IF('BASE TEC-Tec'!J83=\"\",\"\",'BASE TEC-Tec'!J83)","v":""},{"$f":"IF('BASE TEC-Tec'!K83=\"\",\"\",'BASE TEC-Tec'!K83)","v":""}]
[{"$f":"'BASE TEC-Tec'!B84","v":"brise-soleil en toile ou en bois"},{"$f":"IF('BASE TEC-Tec'!J84=\"\",\"\",'BASE TEC-Tec'!J84)","v":"kgCO2e / m²"},{"$f":"IF('BASE TEC-Tec'!K84=\"\",\"\",'BASE TEC-Tec'!K84)","v":0}]
[{"$f":"'BASE TEC-Tec'!B85","v":"brise-soleil en aluminium"},{"$f":"IF('BASE TEC-Tec'!J85=\"\",\"\",'BASE TEC-Tec'!J85)","v":"kgCO2e / m²"},{"$f":"IF('BASE TEC-Tec'!K85=\"\",\"\",'BASE TEC-Tec'!K85)","v":100}]
[{"$f":"'BASE TEC-Tec'!B86","v":"motorisation des brise-soleil"},{"$f":"IF('BASE TEC-Tec'!J86=\"\",\"\",'BASE TEC-Tec'!J86)","v":"kgCO2e / m²"},{"$f":"IF('BASE TEC-Tec'!K86=\"\",\"\",'BASE TEC-Tec'!K86)","v":10}]
[{"$f":"'BASE TEC-Tec'!B91","v":"casquette (et/ou joue) bois"},{"$f":"IF('BASE TEC-Tec'!J91=\"\",\"\",'BASE TEC-Tec'!J91)","v":"kgCO2e / m²"},{"$f":"IF('BASE TEC-Tec'!K91=\"\",\"\",'BASE TEC-Tec'!K91)","v":-10}]
[{"$f":"'BASE TEC-Tec'!B92","v":"casquette (et/ou joue) métal"},{"$f":"IF('BASE TEC-Tec'!J92=\"\",\"\",'BASE TEC-Tec'!J92)","v":"kgCO2e / m²"},{"$f":"IF('BASE TEC-Tec'!K92=\"\",\"\",'BASE TEC-Tec'!K92)","v":30}]
[{"$f":"'BASE TEC-Tec'!B93","v":"casquette (et/ou joue) béton"},{"$f":"IF('BASE TEC-Tec'!J93=\"\",\"\",'BASE TEC-Tec'!J93)","v":"kgCO2e / m²"},{"$f":"IF('BASE TEC-Tec'!K93=\"\",\"\",'BASE TEC-Tec'!K93)","v":40}]
[{"$f":"'BASE TEC-Tec'!B94","v":"Toiture"},{"$f":"IF('BASE TEC-Tec'!J94=\"\",\"\",'BASE TEC-Tec'!J94)","v":""},{"$f":"IF('BASE TEC-Tec'!K94=\"\",\"\",'BASE TEC-Tec'!K94)","v":""}]
[{"$f":"'BASE TEC-Tec'!B95","v":"dalle béton"},{"$f":"IF('BASE TEC-Tec'!J95=\"\",\"\",'BASE TEC-Tec'!J95)","v":"kgCO2e / m²"},{"$f":"IF('BASE TEC-Tec'!K95=\"\",\"\",'BASE TEC-Tec'!K95)","v":108}]
[{"$f":"'BASE TEC-Tec'!B96","v":"plancher bois"},{"$f":"IF('BASE TEC-Tec'!J96=\"\",\"\",'BASE TEC-Tec'!J96)","v":"kgCO2e / m²"},{"$f":"IF('BASE TEC-Tec'!K96=\"\",\"\",'BASE TEC-Tec'!K96)","v":-20}]
[{"$f":"'BASE TEC-Tec'!B97","v":"charpente métallique"},{"$f":"IF('BASE TEC-Tec'!J97=\"\",\"\",'BASE TEC-Tec'!J97)","v":"kgCO2e / m²"},{"$f":"IF('BASE TEC-Tec'!K97=\"\",\"\",'BASE TEC-Tec'!K97)","v":40}]
[{"$f":"'BASE TEC-Tec'!B98","v":"charpente bois"},{"$f":"IF('BASE TEC-Tec'!J98=\"\",\"\",'BASE TEC-Tec'!J98)","v":"kgCO2e / m²"},{"$f":"IF('BASE TEC-Tec'!K98=\"\",\"\",'BASE TEC-Tec'!K98)","v":-20}]
[{"$f":"'BASE TEC-Tec'!B99","v":"revêtement d'étanchéité"},{"$f":"IF('BASE TEC-Tec'!J99=\"\",\"\",'BASE TEC-Tec'!J99)","v":"kgCO2e / m²"},{"$f":"IF('BASE TEC-Tec'!K99=\"\",\"\",'BASE TEC-Tec'!K99)","v":20}]
[{"$f":"'BASE TEC-Tec'!B100","v":"couverte en tôle"},{"$f":"IF('BASE TEC-Tec'!J100=\"\",\"\",'BASE TEC-Tec'!J100)","v":"kgCO2e / m²"},{"$f":"IF('BASE TEC-Tec'!K100=\"\",\"\",'BASE TEC-Tec'!K100)","v":20}]
[{"$f":"'BASE TEC-Tec'!B101","v":"couverture biosourcée"},{"$f":"IF('BASE TEC-Tec'!J101=\"\",\"\",'BASE TEC-Tec'!J101)","v":"kgCO2e / m²"},{"$f":"IF('BASE TEC-Tec'!K101=\"\",\"\",'BASE TEC-Tec'!K101)","v":-5}]
[{"$f":"'BASE TEC-Tec'!B102","v":"Isolation"},{"$f":"IF('BASE TEC-Tec'!J102=\"\",\"\",'BASE TEC-Tec'!J102)","v":""},{"$f":"IF('BASE TEC-Tec'!K102=\"\",\"\",'BASE TEC-Tec'!K102)","v":""}]
[{"$f":"'BASE TEC-Tec'!B103","v":"toiture"},{"$f":"IF('BASE TEC-Tec'!J103=\"\",\"\",'BASE TEC-Tec'!J103)","v":"kg CO2e / m³"},{"$f":"IF('BASE TEC-Tec'!K103=\"\",\"\",'BASE TEC-Tec'!K103)","v":10}]
[{"$f":"'BASE TEC-Tec'!D106","v":"sans isolant"},"coefficient",{"$f":"'BASE TEC-Tec'!E106","v":0}]
[{"$f":"'BASE TEC-Tec'!D107","v":"isolant conventionnel"},"coefficient",{"$f":"'BASE TEC-Tec'!E107","v":1}]
[{"$f":"'BASE TEC-Tec'!D108","v":"isolant biosourcé"},"coefficient",{"$f":"'BASE TEC-Tec'!E108","v":-1}]
[{"$f":"'BASE TEC-Tec'!B109","v":"façades avec isolant conventionnel"},{"$f":"IF('BASE TEC-Tec'!J109=\"\",\"\",'BASE TEC-Tec'!J109)","v":"kgCO2e / m²"},{"$f":"IF('BASE TEC-Tec'!K109=\"\",\"\",'BASE TEC-Tec'!K109)","v":20}]
[{"$f":"'BASE TEC-Tec'!B110","v":"façades avec isolant biosourcé"},{"$f":"IF('BASE TEC-Tec'!J110=\"\",\"\",'BASE TEC-Tec'!J110)","v":"kgCO2e / m²"},{"$f":"IF('BASE TEC-Tec'!K110=\"\",\"\",'BASE TEC-Tec'!K110)","v":-10}]
[{"$f":"'BASE TEC-Tec'!B111","v":"Habillages intérieurs"},{"$f":"IF('BASE TEC-Tec'!J111=\"\",\"\",'BASE TEC-Tec'!J111)","v":""},{"$f":"IF('BASE TEC-Tec'!K111=\"\",\"\",'BASE TEC-Tec'!K111)","v":""}]
[{"$f":"'BASE TEC-Tec'!B112","v":"faux-plafond minéral"},{"$f":"IF('BASE TEC-Tec'!J112=\"\",\"\",'BASE TEC-Tec'!J112)","v":"kgCO2e / m²"},{"$f":"IF('BASE TEC-Tec'!K112=\"\",\"\",'BASE TEC-Tec'!K112)","v":25}]
[{"$f":"'BASE TEC-Tec'!B113","v":"faux-plancher technique"},{"$f":"IF('BASE TEC-Tec'!J113=\"\",\"\",'BASE TEC-Tec'!J113)","v":"kgCO2e / m²"},{"$f":"IF('BASE TEC-Tec'!K113=\"\",\"\",'BASE TEC-Tec'!K113)","v":40}]
[{"$f":"'BASE TEC-Tec'!B114","v":"autres"},{"$f":"IF('BASE TEC-Tec'!J114=\"\",\"\",'BASE TEC-Tec'!J114)","v":""},{"$f":"IF('BASE TEC-Tec'!K114=\"\",\"\",'BASE TEC-Tec'!K114)","v":""}]
[{"$f":"'BASE TEC-Tec'!B115","v":"Production locale d'EnR"},{"$f":"IF('BASE TEC-Tec'!J115=\"\",\"\",'BASE TEC-Tec'!J115)","v":"m² PV / kWc"},{"$f":"IF('BASE TEC-Tec'!K115=\"\",\"\",'BASE TEC-Tec'!K115)","v":8}]
[{"$f":"'BASE TEC-Tec'!B116","v":"installation solaire thermique"},{"$f":"IF('BASE TEC-Tec'!J116=\"\",\"\",'BASE TEC-Tec'!J116)","v":"kgCO2e / m²"},{"$f":"IF('BASE TEC-Tec'!K116=\"\",\"\",'BASE TEC-Tec'!K116)","v":80}]
[{"$f":"'BASE TEC-Tec'!B117","v":"installation photovoltaïque sans batterie"},{"$f":"IF('BASE TEC-Tec'!J117=\"\",\"\",'BASE TEC-Tec'!J117)","v":"kgCO2e / kWc"},{"$f":"IF('BASE TEC-Tec'!K117=\"\",\"\",'BASE TEC-Tec'!K117)","v":2000}]
[{"$f":"'BASE TEC-Tec'!B118","v":"installation photovoltaïque avec batteries"},{"$f":"IF('BASE TEC-Tec'!J118=\"\",\"\",'BASE TEC-Tec'!J118)","v":"kgCO2e / kWc"},{"$f":"IF('BASE TEC-Tec'!K118=\"\",\"\",'BASE TEC-Tec'!K118)","v":3000}]
[{"$f":"'BASE TEC-Tec'!B119","v":"Variation d'albédo"},{"$f":"IF('BASE TEC-Tec'!J119=\"\",\"\",'BASE TEC-Tec'!J119)","v":""},{"$f":"IF('BASE TEC-Tec'!K119=\"\",\"\",'BASE TEC-Tec'!K119)","v":""}]
[{"$f":"'BASE TEC-Tec'!B120","v":"ton presque inchangé"},{"$f":"IF('BASE TEC-Tec'!J120=\"\",\"\",'BASE TEC-Tec'!J120)","v":"kgCO2e / m²"},{"$f":"IF('BASE TEC-Tec'!K120=\"\",\"\",'BASE TEC-Tec'!K120)","v":0}]
[{"$f":"'BASE TEC-Tec'!B121","v":"fonçage (couleur foncée → noir)"},{"$f":"IF('BASE TEC-Tec'!J121=\"\",\"\",'BASE TEC-Tec'!J121)","v":"kgCO2e / m²"},{"$f":"IF('BASE TEC-Tec'!K121=\"\",\"\",'BASE TEC-Tec'!K121)","v":32}]
[{"$f":"'BASE TEC-Tec'!B122","v":"éclaircissement (couleur foncée → couleur moyenne)"},{"$f":"IF('BASE TEC-Tec'!J122=\"\",\"\",'BASE TEC-Tec'!J122)","v":"kgCO2e / m²"},{"$f":"IF('BASE TEC-Tec'!K122=\"\",\"\",'BASE TEC-Tec'!K122)","v":-48}]
[{"$f":"'BASE TEC-Tec'!B123","v":"fort éclaircissement (couleur foncée → couleur très claire)"},{"$f":"IF('BASE TEC-Tec'!J123=\"\",\"\",'BASE TEC-Tec'!J123)","v":"kgCO2e / m²"},{"$f":"IF('BASE TEC-Tec'!K123=\"\",\"\",'BASE TEC-Tec'!K123)","v":-96}]
[{"$f":"'BASE TEC-Tec'!B124","v":"Installation de chantier"},"kgCO2e/SdP",30]
[{"$f":"'BASE TEC-Tec'!D127","v":"conventionnelle"},"coefficient",{"$f":"'BASE TEC-Tec'!E127","v":1}]
[{"$f":"'BASE TEC-Tec'!D128","v":"chantier vert"},"coefficient",{"$f":"'BASE TEC-Tec'!E128","v":0.8}]
[{"$f":"'BASE TEC-Tec'!B131","v":"Autres corps d'état"},{"$f":"IF('BASE TEC-Tec'!J131=\"\",\"\",'BASE TEC-Tec'!J131)","v":"kgCO2e / m² de SU"},{"$f":"IF('BASE TEC-Tec'!K131=\"\",\"\",'BASE TEC-Tec'!K131)","v":100},null,{"$f":"_xlfn.FLOOR.MATH(25648,-2,0)","v":25648}]
[]
["ENERGIE",{"$f":"IF('BASE TEC-Tec'!J129=\"\",\"\",'BASE TEC-Tec'!J129)","v":""},{"$f":"IF('BASE TEC-Tec'!K129=\"\",\"\",'BASE TEC-Tec'!K129)","v":""}]
[{"$f":"'BASE TEC-Tec'!B134","v":"Rafraîchissement pour le confort"},{"$f":"IF('BASE TEC-Tec'!J134=\"\",\"\",'BASE TEC-Tec'!J134)","v":"kg CO2e / kWh"},{"$f":"IF('BASE TEC-Tec'!K134=\"\",\"\",'BASE TEC-Tec'!K134)","v":0.65}]
[{"$f":"'BASE TEC-Tec'!B135","v":"zone en ventilation naturelle + brasseurs d'air"},{"$f":"IF('BASE TEC-Tec'!J135=\"\",\"\",'BASE TEC-Tec'!J135)","v":""},{"$f":"IF('BASE TEC-Tec'!K135=\"\",\"\",'BASE TEC-Tec'!K135)","v":""}]
[{"$f":"'BASE TEC-Tec'!B136","v":"performance de l'enveloppe et de son environnement"},{"$f":"IF('BASE TEC-Tec'!J136=\"\",\"\",'BASE TEC-Tec'!J136)","v":""},{"$f":"IF('BASE TEC-Tec'!K136=\"\",\"\",'BASE TEC-Tec'!K136)","v":""}]
[{"$f":"'BASE TEC-Tec'!D138","v":"médiocre"},"W / m²",{"$f":"'BASE TEC-Tec'!E138","v":6}]
[{"$f":"'BASE TEC-Tec'!D139","v":"correcte"},"W / m²",{"$f":"'BASE TEC-Tec'!E139","v":4}]
[{"$f":"'BASE TEC-Tec'!D140","v":"performante"},"W / m²",{"$f":"'BASE TEC-Tec'!E140","v":3}]
[{"$f":"'BASE TEC-Tec'!B142","v":"zone en climatisation + ventilation naturelle + brasseurs d'air"},{"$f":"IF('BASE TEC-Tec'!J142=\"\",\"\",'BASE TEC-Tec'!J142)","v":""},{"$f":"IF('BASE TEC-Tec'!K142=\"\",\"\",'BASE TEC-Tec'!K142)","v":""}]
[{"$f":"'BASE TEC-Tec'!B143","v":"performance de l'enveloppe et de son environnement"},{"$f":"IF('BASE TEC-Tec'!J143=\"\",\"\",'BASE TEC-Tec'!J143)","v":""},{"$f":"IF('BASE TEC-Tec'!K143=\"\",\"\",'BASE TEC-Tec'!K143)","v":""}]
[{"$f":"'BASE TEC-Tec'!D144","v":"médiocre"},"W / m²",{"$f":"'BASE TEC-Tec'!E144","v":30}]
[{"$f":"'BASE TEC-Tec'!D145","v":"correcte"},"W / m²",{"$f":"'BASE TEC-Tec'!E145","v":20}]
[{"$f":"'BASE TEC-Tec'!D146","v":"performante"},"W / m²",{"$f":"'BASE TEC-Tec'!E146","v":10}]
[{"$f":"'BASE TEC-Tec'!B147","v":"durée de fonctionnement de la climatisation"},{"$f":"IF('BASE TEC-Tec'!J147=\"\",\"\",'BASE TEC-Tec'!J147)","v":""},{"$f":"IF('BASE TEC-Tec'!K147=\"\",\"\",'BASE TEC-Tec'!K147)","v":""}]
[{"$f":"'BASE TEC-Tec'!D149","v":"très faible (environ 1 mois 1/2)"},"mois",{"$f":"'BASE TEC-Tec'!E149","v":1.5}]
[{"$f":"'BASE TEC-Tec'!D150","v":"occasionnelle (environ 3 mois)"},"mois",{"$f":"'BASE TEC-Tec'!E150","v":3}]
[{"$f":"'BASE TEC-Tec'!D151","v":"fréquente (environ 6 mois)"},"mois",{"$f":"'BASE TEC-Tec'!E151","v":6}]
[{"$f":"'BASE TEC-Tec'!B153","v":"zone en climatisation + brasseurs d'air"},{"$f":"IF('BASE TEC-Tec'!J153=\"\",\"\",'BASE TEC-Tec'!J153)","v":""},{"$f":"IF('BASE TEC-Tec'!K153=\"\",\"\",'BASE TEC-Tec'!K153)","v":""}]
[{"$f":"'BASE TEC-Tec'!B154","v":"performance de l'enveloppe et de son environnement"},{"$f":"IF('BASE TEC-Tec'!J154=\"\",\"\",'BASE TEC-Tec'!J154)","v":""},{"$f":"IF('BASE TEC-Tec'!K154=\"\",\"\",'BASE TEC-Tec'!K154)","v":""}]
[{"$f":"'BASE TEC-Tec'!D155","v":"médiocre"},"W / m²",{"$f":"'BASE TEC-Tec'!E155","v":30}]
[{"$f":"'BASE TEC-Tec'!D156","v":"correcte"},"W / m²",{"$f":"'BASE TEC-Tec'!E156","v":20}]
[{"$f":"'BASE TEC-Tec'!D157","v":"performante"},"W / m²",{"$f":"'BASE TEC-Tec'!E157","v":10}]
[{"$f":"'BASE TEC-Tec'!B158","v":"durée de fonctionnement de la climatisation"},{"$f":"IF('BASE TEC-Tec'!J156=\"\",\"\",'BASE TEC-Tec'!J156)","v":""},{"$f":"IF('BASE TEC-Tec'!K158=\"\",\"\",'BASE TEC-Tec'!K158)","v":""}]
[{"$f":"'BASE TEC-Tec'!D160","v":"fréquente (environ 8 mois)"},"mois",{"$f":"'BASE TEC-Tec'!E160","v":8}]
[{"$f":"'BASE TEC-Tec'!D161","v":"permanente (environ 12 mois)"},"mois",{"$f":"'BASE TEC-Tec'!E161","v":12}]
[{"$f":"'BASE TEC-Tec'!B163","v":"zone en climatisation seule (hors locaux techniques)"},{"$f":"IF('BASE TEC-Tec'!J163=\"\",\"\",'BASE TEC-Tec'!J163)","v":""},{"$f":"IF('BASE TEC-Tec'!K163=\"\",\"\",'BASE TEC-Tec'!K163)","v":""}]
[{"$f":"'BASE TEC-Tec'!B164","v":"performance de l'enveloppe et de son environnement"},{"$f":"IF('BASE TEC-Tec'!J164=\"\",\"\",'BASE TEC-Tec'!J164)","v":""},{"$f":"IF('BASE TEC-Tec'!K164=\"\",\"\",'BASE TEC-Tec'!K164)","v":""}]
[{"$f":"'BASE TEC-Tec'!D165","v":"médiocre"},"W / m²",{"$f":"'BASE TEC-Tec'!E165","v":50}]
[{"$f":"'BASE TEC-Tec'!D166","v":"correcte"},"W / m²",{"$f":"'BASE TEC-Tec'!E166","v":35}]
[{"$f":"'BASE TEC-Tec'!D167","v":"performante"},"W / m²",{"$f":"'BASE TEC-Tec'!E167","v":20}]
[{"$f":"'BASE TEC-Tec'!B168","v":"durée de fonctionnement"},{"$f":"IF('BASE TEC-Tec'!J164=\"\",\"\",'BASE TEC-Tec'!J164)","v":""},{"$f":"IF('BASE TEC-Tec'!K168=\"\",\"\",'BASE TEC-Tec'!K168)","v":""}]
[{"$f":"'BASE TEC-Tec'!D170","v":"fréquente (environ 8 mois)"},"mois",{"$f":"'BASE TEC-Tec'!E170","v":8}]
[{"$f":"'BASE TEC-Tec'!D171","v":"permanente (environ 12 mois)"},"mois",{"$f":"'BASE TEC-Tec'!E171","v":12}]
[{"$f":"'BASE TEC-Tec'!B175","v":"Fuite de fluide frigorigène"},{"$f":"IF('BASE TEC-Tec'!J175=\"\",\"\",'BASE TEC-Tec'!J175)","v":"kg CO2e / kg HFC"},{"$f":"IF('BASE TEC-Tec'!K175=\"\",\"\",'BASE TEC-Tec'!K175)","v":2000}]
[{"$f":"'BASE TEC-Tec'!B177","v":"charge en fluide HFC"},{"$f":"'BASE TEC-Tec'!D177","v":"kg HFC / kW frigo."},{"$f":"'BASE TEC-Tec'!E177","v":0.44000000000000006}]
[{"$f":"'BASE TEC-Tec'!B178","v":"taux de fuite"},{"$f":"'BASE TEC-Tec'!D178","v":"% / an"},{"$f":"'BASE TEC-Tec'!E178","v":0.13}]
[{"$f":"'BASE TEC-Tec'!B179","v":"Éclairage intérieur"},{"$f":"IF('BASE TEC-Tec'!J179=\"\",\"\",'BASE TEC-Tec'!J179)","v":"kg CO2e / kWh"},{"$f":"IF('BASE TEC-Tec'!K179=\"\",\"\",'BASE TEC-Tec'!K179)","v":0.7}]
[{"$f":"'BASE TEC-Tec'!B180","v":"proportion d'éclairement standard (vs surface de vente)"},{"$f":"IF('BASE TEC-Tec'!J180=\"\",\"\",'BASE TEC-Tec'!J180)","v":""},{"$f":"IF('BASE TEC-Tec'!K180=\"\",\"\",'BASE TEC-Tec'!K180)","v":""}]
[{"$f":"'BASE TEC-Tec'!D181","v":"fort (surface de vente)"},"coefficient",{"$f":"'BASE TEC-Tec'!E181","v":10}]
[{"$f":"'BASE TEC-Tec'!B182","v":"performance des équipements et optimisation d'installation"},{"$f":"IF('BASE TEC-Tec'!J182=\"\",\"\",'BASE TEC-Tec'!J182)","v":""},{"$f":"IF('BASE TEC-Tec'!K182=\"\",\"\",'BASE TEC-Tec'!K182)","v":""}]
[{"$f":"'BASE TEC-Tec'!D184","v":"faible"},"W / m²",{"$f":"'BASE TEC-Tec'!E184","v":5}]
[{"$f":"'BASE TEC-Tec'!D185","v":"moyenne"},"W / m²",{"$f":"'BASE TEC-Tec'!E185","v":4}]
[{"$f":"'BASE TEC-Tec'!D186","v":"élevée"},"W / m²",{"$f":"'BASE TEC-Tec'!E186","v":3}]
[{"$f":"'BASE TEC-Tec'!B187","v":"plage de fonctionnement"},{"$f":"IF('BASE TEC-Tec'!J187=\"\",\"\",'BASE TEC-Tec'!J187)","v":""},{"$f":"IF('BASE TEC-Tec'!K187=\"\",\"\",'BASE TEC-Tec'!K187)","v":""}]
[{"$f":"'BASE TEC-Tec'!D189","v":"2 heures / jour"},"heures / jour",{"$f":"'BASE TEC-Tec'!E189","v":2}]
[{"$f":"'BASE TEC-Tec'!D190","v":"4 heures / jour"},"heures / jour",{"$f":"'BASE TEC-Tec'!E190","v":4}]
[{"$f":"'BASE TEC-Tec'!D191","v":"7 heures / jour"},"heures / jour",{"$f":"'BASE TEC-Tec'!E191","v":7}]
[{"$f":"'BASE TEC-Tec'!D192","v":"12 heures / jour"},"heures / jour",{"$f":"'BASE TEC-Tec'!E192","v":12}]
[{"$f":"'BASE TEC-Tec'!B194","v":"Éclairage extérieur"},{"$f":"IF('BASE TEC-Tec'!J194=\"\",\"\",'BASE TEC-Tec'!J194)","v":"kg CO2e / kWh"},{"$f":"IF('BASE TEC-Tec'!K194=\"\",\"\",'BASE TEC-Tec'!K194)","v":0.75}]
[{"$f":"'BASE TEC-Tec'!B195","v":"gestion de l'éclairage"},{"$f":"IF('BASE TEC-Tec'!J195=\"\",\"\",'BASE TEC-Tec'!J195)","v":""},{"$f":"IF('BASE TEC-Tec'!K195=\"\",\"\",'BASE TEC-Tec'!K195)","v":""}]
[{"$f":"'BASE TEC-Tec'!D197","v":"horloge simple"},"coefficient",{"$f":"'BASE TEC-Tec'!E197","v":1}]
[{"$f":"'BASE TEC-Tec'!D198","v":"horloge astronomique"},"coefficient",{"$f":"'BASE TEC-Tec'!E198","v":0.8}]
[{"$f":"'BASE TEC-Tec'!D199","v":"détection de présence"},"coefficient",{"$f":"'BASE TEC-Tec'!E199","v":0.4}]
[{"$f":"'BASE TEC-Tec'!D200","v":"interrupteurs temporisés"},"coefficient",{"$f":"'BASE TEC-Tec'!E200","v":0.2}]
[{"$f":"'BASE TEC-Tec'!B201","v":"zones éclairées"},{"$f":"IF('BASE TEC-Tec'!J201=\"\",\"\",'BASE TEC-Tec'!J201)","v":""},{"$f":"IF('BASE TEC-Tec'!K201=\"\",\"\",'BASE TEC-Tec'!K201)","v":""}]
[{"$f":"'BASE TEC-Tec'!D203","v":"extérieur complet à 20 lux"},"kWh / m² / an",{"$f":"'BASE TEC-Tec'!E203*6","v":9}]
[{"$f":"'BASE TEC-Tec'!D204","v":"ch. piéton à 20 lux + façades"},"kWh / m² / an",{"$f":"'BASE TEC-Tec'!E204*6","v":6}]
[{"$f":"'BASE TEC-Tec'!D205","v":"cheminement piéton à 20 lux"},"kWh / m² / an",{"$f":"'BASE TEC-Tec'!E205*6","v":3}]
[{"$f":"'BASE TEC-Tec'!B207","v":"Traitement d'air technique"},{"$f":"IF('BASE TEC-Tec'!J207=\"\",\"\",'BASE TEC-Tec'!J207)","v":"kg CO2e / kWh"},{"$f":"IF('BASE TEC-Tec'!K207=\"\",\"\",'BASE TEC-Tec'!K207)","v":0.75}]
[{"$f":"'BASE TEC-Tec'!B208","v":"locaux techniques climatisés"},{"$f":"IF('BASE TEC-Tec'!J208=\"\",\"\",'BASE TEC-Tec'!J208)","v":""},{"$f":"IF('BASE TEC-Tec'!K208=\"\",\"\",'BASE TEC-Tec'!K208)","v":""}]
[{"$f":"'BASE TEC-Tec'!B210","v":"Fuite de fluide frigorigène"},{"$f":"IF('BASE TEC-Tec'!J210=\"\",\"\",'BASE TEC-Tec'!J210)","v":"kg CO2e / kg HFC"},{"$f":"IF('BASE TEC-Tec'!K210=\"\",\"\",'BASE TEC-Tec'!K210)","v":2000}]
[{"$f":"'BASE TEC-Tec'!B211","v":"puissance installée avec fluide HFC"},{"$f":"'BASE TEC-Tec'!D211","v":"kg HFC / split"},{"$f":"'BASE TEC-Tec'!E211","v":2.7}]
[{"$f":"'BASE TEC-Tec'!B212","v":"installation VMC des sanitaires"},{"$f":"IF('BASE TEC-Tec'!J212=\"\",\"\",'BASE TEC-Tec'!J212)","v":""},{"$f":"IF('BASE TEC-Tec'!K212=\"\",\"\",'BASE TEC-Tec'!K212)","v":""}]
[{"$f":"'BASE TEC-Tec'!D214","v":"oui"},null,{"$f":"'BASE TEC-Tec'!E214","v":1}]
[{"$f":"'BASE TEC-Tec'!D215","v":"non"},null,{"$f":"'BASE TEC-Tec'!E215","v":0}]
[{"$f":"'BASE TEC-Tec'!B216","v":"consommation unitaire"},{"$f":"'BASE TEC-Tec'!D216","v":"kWh / m²"},{"$f":"'BASE TEC-Tec'!E216","v":2.2000000000000002}]
[{"$f":"'BASE TEC-Tec'!B217","v":"Forces motrices"},{"$f":"IF('BASE TEC-Tec'!J217=\"\",\"\",'BASE TEC-Tec'!J217)","v":"kg CO2e / kWh"},{"$f":"IF('BASE TEC-Tec'!K217=\"\",\"\",'BASE TEC-Tec'!K217)","v":0.75}]
[{"$f":"'BASE TEC-Tec'!B219","v":"consommation unitaire"},{"$f":"'BASE TEC-Tec'!D219","v":"kWh / ascenseur"},{"$f":"'BASE TEC-Tec'!E219","v":1000}]
[{"$f":"'BASE TEC-Tec'!B220","v":"Cuisine"},{"$f":"IF('BASE TEC-Tec'!J220=\"\",\"\",'BASE TEC-Tec'!J220)","v":""},{"$f":"IF('BASE TEC-Tec'!K220=\"\",\"\",'BASE TEC-Tec'!K220)","v":""}]
[{"$f":"'BASE TEC-Tec'!B221","v":"consommation de gaz"},{"$f":"IF('BASE TEC-Tec'!J221=\"\",\"\",'BASE TEC-Tec'!J221)","v":"kg CO2e / kWh"},{"$f":"IF('BASE TEC-Tec'!K221=\"\",\"\",'BASE TEC-Tec'!K221)","v":0.3}]
[{"$f":"'BASE TEC-Tec'!B222","v":"consommation électrique"},{"$f":"IF('BASE TEC-Tec'!J222=\"\",\"\",'BASE TEC-Tec'!J222)","v":"kg CO2e / kWh"},{"$f":"IF('BASE TEC-Tec'!K222=\"\",\"\",'BASE TEC-Tec'!K222)","v":0.65}]
[{"$f":"'BASE TEC-Tec'!B223","v":"type de cuisine"},{"$f":"IF('BASE TEC-Tec'!J223=\"\",\"\",'BASE TEC-Tec'!J223)","v":""},{"$f":"IF('BASE TEC-Tec'!K223=\"\",\"\",'BASE TEC-Tec'!K223)","v":""}]
[{"$f":"'BASE TEC-Tec'!D225","v":"sans cuisine"},"kWh / m² / an",{"$f":"'BASE TEC-Tec'!E225","v":0}]
[{"$f":"'BASE TEC-Tec'!D226","v":"liaison chaude"},"kWh / m² / an",{"$f":"'BASE TEC-Tec'!E226","v":130}]
[{"$f":"'BASE TEC-Tec'!D227","v":"liaison froide"},"kWh / m² / an",{"$f":"'BASE TEC-Tec'!E227","v":250}]
[{"$f":"'BASE TEC-Tec'!D228","v":"production de repas (électrique)"},"kWh / m² / an",{"$f":"'BASE TEC-Tec'!E228","v":900}]
[{"$f":"'BASE TEC-Tec'!D229","v":"production de repas (gaz)"},"kWh / m² / an",{"$f":"'BASE TEC-Tec'!E229","v":500}]
[{"$f":"'BASE TEC-Tec'!B230","v":"eau chaude pour la cuisine"},null,{"$f":"IF('BASE TEC-Tec'!K230=\"\",\"\",'BASE TEC-Tec'!K230)","v":""}]
[{"$f":"'BASE TEC-Tec'!D232","v":"sans (ou sur ECS)"},"kWh / m² / an",{"$f":"'BASE TEC-Tec'!E232","v":0}]
[{"$f":"'BASE TEC-Tec'!D233","v":"électrique"},"kWh / m² / an",{"$f":"'BASE TEC-Tec'!E233","v":150}]
[{"$f":"'BASE TEC-Tec'!D234","v":"solaire + appoint électrique"},"kWh / m² / an",{"$f":"'BASE TEC-Tec'!E234","v":50}]
[{"$f":"'BASE TEC-Tec'!D235","v":"thermodynamique"},"kWh / m² / an",{"$f":"'BASE TEC-Tec'!E235","v":60}]
[{"$f":"'BASE TEC-Tec'!D236","v":"gaz"},"kWh / m² / an",{"$f":"'BASE TEC-Tec'!E236","v":0}]
[{"$f":"'BASE TEC-Tec'!B240","v":"Prises de courant"},{"$f":"IF('BASE TEC-Tec'!J240=\"\",\"\",'BASE TEC-Tec'!J240)","v":""},{"$f":"IF('BASE TEC-Tec'!K240=\"\",\"\",'BASE TEC-Tec'!K240)","v":""}]
[{"$f":"'BASE TEC-Tec'!D242","v":"sans gestion"},"kWh / m² / an",{"$f":"'BASE TEC-Tec'!E242","v":1}]
[{"$f":"'BASE TEC-Tec'!D243","v":"extinction auto. des veilles"},"kWh / m² / an",{"$f":"'BASE TEC-Tec'!E243","v":0.75}]
[{"$f":"'BASE TEC-Tec'!B244","v":"prises de courant permanentes"},{"$f":"IF('BASE TEC-Tec'!J244=\"\",\"\",'BASE TEC-Tec'!J244)","v":"kg CO2e / kWh"},{"$f":"IF('BASE TEC-Tec'!K244=\"\",\"\",'BASE TEC-Tec'!K244)","v":0.75}]
[{"$f":"'BASE TEC-Tec'!B246","v":"bureautique"},{"$f":"IF('BASE TEC-Tec'!J246=\"\",\"\",'BASE TEC-Tec'!J246)","v":""},{"$f":"IF('BASE TEC-Tec'!K246=\"\",\"\",'BASE TEC-Tec'!K246)","v":""}]
[{"$f":"'BASE TEC-Tec'!D248","v":"standard"},"kWh / m² / an",{"$f":"'BASE TEC-Tec'!E248","v":1}]
[{"$f":"'BASE TEC-Tec'!D249","v":"à faible consommation"},"kWh / m² / an",{"$f":"'BASE TEC-Tec'!E249","v":0.5}]
[{"$f":"'BASE TEC-Tec'!B250","v":"prises de courant intermittentes"},{"$f":"IF('BASE TEC-Tec'!J250=\"\",\"\",'BASE TEC-Tec'!J250)","v":"kg CO2e / kWh"},{"$f":"IF('BASE TEC-Tec'!K250=\"\",\"\",'BASE TEC-Tec'!K250)","v":0.7}]
[{"$f":"'BASE TEC-Tec'!B252","v":"Eau Chaude Sanitaire"},{"$f":"IF('BASE TEC-Tec'!J252=\"\",\"\",'BASE TEC-Tec'!J252)","v":"kg CO2e / kWh"},{"$f":"IF('BASE TEC-Tec'!K252=\"\",\"\",'BASE TEC-Tec'!K252)","v":0.75}]
[{"$f":"'BASE TEC-Tec'!B253","v":"consommation unitaire"},{"$f":"IF('BASE TEC-Tec'!J253=\"\",\"\",'BASE TEC-Tec'!J253)","v":""},{"$f":"IF('BASE TEC-Tec'!K253=\"\",\"\",'BASE TEC-Tec'!K253)","v":""}]
[{"$f":"'BASE TEC-Tec'!D255","v":"sans"},"kWh / m² / an",{"$f":"'BASE TEC-Tec'!E255","v":0}]
[{"$f":"'BASE TEC-Tec'!D256","v":"100 % solaire"},"kWh / m² / an",{"$f":"'BASE TEC-Tec'!E256","v":0.2}]
[{"$f":"'BASE TEC-Tec'!D257","v":"solaire + appoint électrique"},"kWh / m² / an",{"$f":"'BASE TEC-Tec'!E257","v":2}]
[{"$f":"'BASE TEC-Tec'!D258","v":"thermodynamique"},"kWh / m² / an",{"$f":"'BASE TEC-Tec'!E258","v":2}]
[{"$f":"'BASE TEC-Tec'!D259","v":"ballon élec. à accumulateur"},"kWh / m² / an",{"$f":"'BASE TEC-Tec'!E259","v":5}]
[{"$f":"'BASE TEC-Tec'!D260","v":"chauffe-eau instantané"},"kWh / m² / an",{"$f":"'BASE TEC-Tec'!E260","v":10}]
[{"$f":"'BASE TEC-Tec'!B261","v":"Froid commercial"},{"$f":"IF('BASE TEC-Tec'!J261=\"\",\"\",'BASE TEC-Tec'!J261)","v":"kg CO2e / kWh"},{"$f":"IF('BASE TEC-Tec'!K261=\"\",\"\",'BASE TEC-Tec'!K261)","v":0.7}]
["chambres froides"]
[{"$f":"'BASE TEC-Tec'!B264","v":"performance des systèmes"},{"$f":"IF('BASE TEC-Tec'!J264=\"\",\"\",'BASE TEC-Tec'!J264)","v":""},{"$f":"IF('BASE TEC-Tec'!K264=\"\",\"\",'BASE TEC-Tec'!K264)","v":""}]
[{"$f":"'BASE TEC-Tec'!D266","v":"faible"},"kWh / m² / an",{"$f":"'BASE TEC-Tec'!E266","v":3000}]
[{"$f":"'BASE TEC-Tec'!D267","v":"moyenne"},"kWh / m² / an",{"$f":"'BASE TEC-Tec'!E267","v":2500}]
[{"$f":"'BASE TEC-Tec'!D268","v":"élevée"},"kWh / m² / an",{"$f":"'BASE TEC-Tec'!E268","v":2000}]
[{"$f":"'BASE TEC-Tec'!B269","v":"valeur froid négatif"},{"$f":"IF('BASE TEC-Tec'!J269=\"\",\"\",'BASE TEC-Tec'!J269)","v":""}]
[{"$f":"'BASE TEC-Tec'!D270","v":"faible"},"kWh / m² / an",{"$f":"'BASE TEC-Tec'!E270","v":6000}]
[{"$f":"'BASE TEC-Tec'!D271","v":"moyenne"},"kWh / m² / an",{"$f":"'BASE TEC-Tec'!E271","v":5000}]
[{"$f":"'BASE TEC-Tec'!D272","v":"élevée"},"kWh / m² / an",{"$f":"'BASE TEC-Tec'!E272","v":4000}]
[{"$f":"'BASE TEC-Tec'!B273","v":"meubles frigorifiques de vente"},{"$f":"IF('BASE TEC-Tec'!J273=\"\",\"\",'BASE TEC-Tec'!J273)","v":""},{"$f":"IF('BASE TEC-Tec'!K273=\"\",\"\",'BASE TEC-Tec'!K273)","v":""}]
[{"$f":"'BASE TEC-Tec'!B274","v":"performance des systèmes"},{"$f":"IF('BASE TEC-Tec'!J274=\"\",\"\",'BASE TEC-Tec'!J274)","v":""},{"$f":"IF('BASE TEC-Tec'!K274=\"\",\"\",'BASE TEC-Tec'!K274)","v":""}]
[{"$f":"'BASE TEC-Tec'!D276","v":"faible"},"kWh / mL / an",{"$f":"'BASE TEC-Tec'!E276","v":4000}]
[{"$f":"'BASE TEC-Tec'!D277","v":"moyenne"},"kWh / mL / an",{"$f":"'BASE TEC-Tec'!E277","v":3000}]
[{"$f":"'BASE TEC-Tec'!D278","v":"élevée"},"kWh / mL / an",{"$f":"'BASE TEC-Tec'!E278","v":2000}]
[{"$f":"'BASE TEC-Tec'!B281","v":"Production d'électricité"},{"$f":"IF('BASE TEC-Tec'!J281=\"\",\"\",'BASE TEC-Tec'!J281)","v":""},{"$f":"IF('BASE TEC-Tec'!K281=\"\",\"\",'BASE TEC-Tec'!K281)","v":""}]
[{"$f":"'BASE TEC-Tec'!B283","v":0},{"$f":"IF('BASE TEC-Tec'!J283=\"\",\"\",'BASE TEC-Tec'!J283)","v":"kg CO2e / kWh"},{"$f":"IF('BASE TEC-Tec'!K283=\"\",\"\",'BASE TEC-Tec'!K283)","v":-0.65}]
[{"$f":"'BASE TEC-Tec'!B285","v":0},{"$f":"IF('BASE TEC-Tec'!J285=\"\",\"\",'BASE TEC-Tec'!J285)","v":"kg CO2e / kWh"},{"$f":"IF('BASE TEC-Tec'!K285=\"\",\"\",'BASE TEC-Tec'!K285)","v":-0.75}]
[{"$f":"'BASE TEC-Tec'!B286","v":"Commissionnement et exploitation"},{"$f":"IF('BASE TEC-Tec'!J286=\"\",\"\",'BASE TEC-Tec'!J286)","v":"kg CO2e / kWh"},{"$f":"IF('BASE TEC-Tec'!K286=\"\",\"\",'BASE TEC-Tec'!K286)","v":0.7}]
[{"$f":"'BASE TEC-Tec'!B287","v":"commissionnement"},{"$f":"IF('BASE TEC-Tec'!J287=\"\",\"\",'BASE TEC-Tec'!J287)","v":""},{"$f":"IF('BASE TEC-Tec'!K287=\"\",\"\",'BASE TEC-Tec'!K287)","v":""}]
[{"$f":"'BASE TEC-Tec'!D289","v":"oui"},"coefficient",{"$f":"'BASE TEC-Tec'!E289","v":1}]
[{"$f":"'BASE TEC-Tec'!D290","v":"non"},"coefficient",{"$f":"'BASE TEC-Tec'!E290","v":1.2}]
[{"$f":"'BASE TEC-Tec'!B291","v":"gestion de l'exploitation"},null,{"$f":"IF('BASE TEC-Tec'!K291=\"\",\"\",'BASE TEC-Tec'!K291)","v":""}]
[{"$f":"'BASE TEC-Tec'!D293","v":"non"},"coefficient",{"$f":"'BASE TEC-Tec'!E293","v":1.2}]
[{"$f":"'BASE TEC-Tec'!D294","v":"partielle"},"coefficient",{"$f":"'BASE TEC-Tec'!E294","v":1}]
[{"$f":"'BASE TEC-Tec'!D295","v":"totale"},"coefficient",{"$f":"'BASE TEC-Tec'!E295","v":0.8}]
[]
["DEPLACEMENTS",{"$f":"IF('BASE TEC-Tec'!J296=\"\",\"\",'BASE TEC-Tec'!J296)","v":""}]
[{"$f":"'BASE TEC-Tec'!B300","v":"Personnel"},{"$f":"IF('BASE TEC-Tec'!J300=\"\",\"\",'BASE TEC-Tec'!J300)","v":""},{"$f":"IF('BASE TEC-Tec'!K300=\"\",\"\",'BASE TEC-Tec'!K300)","v":""}]
["densité avant répartition des déplacements","m² / personne",15]
[{"$f":"'BASE TEC-Tec'!B301","v":"distance moyenne depuis le domicile"},{"$f":"IF('BASE TEC-Tec'!J301=\"\",\"\",'BASE TEC-Tec'!J301)","v":"kg CO2e / km aller"},{"$f":"IF('BASE TEC-Tec'!K301=\"\",\"\",'BASE TEC-Tec'!K301)","v":80}]
[{"$f":"'BASE TEC-Tec'!B302","v":"taux de télétravail (ou de tiers-lieu local)"},{"$f":"IF('BASE TEC-Tec'!J302=\"\",\"\",'BASE TEC-Tec'!J302)","v":"transfert modal"},"moitié"]
[{"$f":"'BASE TEC-Tec'!B303","v":"disponibilité de transports en commun"},{"$f":"IF('BASE TEC-Tec'!J303=\"\",\"\",'BASE TEC-Tec'!J303)","v":"transfert modal"},{"$f":"IF('BASE TEC-Tec'!K303=\"\",\"\",'BASE TEC-Tec'!K303)","v":0.2}]
[{"$f":"'BASE TEC-Tec'!D305","v":"aucune"},"coefficient",{"$f":"'BASE TEC-Tec'!E305","v":0}]
[{"$f":"'BASE TEC-Tec'!D306","v":"faible"},"coefficient",{"$f":"'BASE TEC-Tec'!E306","v":0.2}]
[{"$f":"'BASE TEC-Tec'!D307","v":"une ligne à proximité"},"coefficient",{"$f":"'BASE TEC-Tec'!E307","v":0.5}]
[{"$f":"'BASE TEC-Tec'!D308","v":"maillage à proximité"},"coefficient",{"$f":"'BASE TEC-Tec'!E308","v":1}]
[{"$f":"'BASE TEC-Tec'!B309","v":"emplacements de voitures électriques"},{"$f":"IF('BASE TEC-Tec'!J309=\"\",\"\",'BASE TEC-Tec'!J309)","v":"transfert modal"},{"$f":"IF('BASE TEC-Tec'!K309=\"\",\"\",'BASE TEC-Tec'!K309)","v":0.2}]
[{"$f":"'BASE TEC-Tec'!D311","v":"aucun"},"coefficient",{"$f":"'BASE TEC-Tec'!E311","v":0}]
[{"$f":"'BASE TEC-Tec'!D312","v":"symboliques"},"coefficient",{"$f":"'BASE TEC-Tec'!E312","v":0.2}]
[{"$f":"'BASE TEC-Tec'!D313","v":"nombreux"},"coefficient",{"$f":"'BASE TEC-Tec'!E313","v":0.5}]
[{"$f":"'BASE TEC-Tec'!D314","v":"nombreux + pool de VE"},"coefficient",{"$f":"'BASE TEC-Tec'!E314","v":1}]
[{"$f":"'BASE TEC-Tec'!B315","v":"emplacements pour deux-roues"},{"$f":"IF('BASE TEC-Tec'!J315=\"\",\"\",'BASE TEC-Tec'!J315)","v":"transfert modal"},{"$f":"IF('BASE TEC-Tec'!K315=\"\",\"\",'BASE TEC-Tec'!K315)","v":0.2}]
[{"$f":"'BASE TEC-Tec'!D317","v":"aucun"},"coefficient",{"$f":"'BASE TEC-Tec'!E317","v":0}]
[{"$f":"'BASE TEC-Tec'!D318","v":"abri mis en valeur"},"coefficient",{"$f":"'BASE TEC-Tec'!E318","v":0.5}]
[{"$f":"'BASE TEC-Tec'!D319","v":"local sécurisé et bornes élec."},"coefficient",{"$f":"'BASE TEC-Tec'!E319","v":0.8}]
[{"$f":"'BASE TEC-Tec'!D320","v":"local sécurisé et offre de VAE"},"coefficient",{"$f":"'BASE TEC-Tec'!E320","v":1}]
[{"$f":"'BASE TEC-Tec'!B321","v":"Élèves ou étudiants"},{"$f":"IF('BASE TEC-Tec'!J321=\"\",\"\",'BASE TEC-Tec'!J321)","v":""},{"$f":"IF('BASE TEC-Tec'!K321=\"\",\"\",'BASE TEC-Tec'!K321)","v":""}]
["densité avant répartition des déplacements","m² / personne",2]
[{"$f":"'BASE TEC-Tec'!B322","v":"distance moyenne depuis le domicile"},{"$f":"IF('BASE TEC-Tec'!J322=\"\",\"\",'BASE TEC-Tec'!J322)","v":"kg CO2e / km aller"},{"$f":"IF('BASE TEC-Tec'!K322=\"\",\"\",'BASE TEC-Tec'!K322)","v":40}]
[{"$f":"'BASE TEC-Tec'!B323","v":"taux de télétravail (ou de tiers-lieu local)"},{"$f":"IF('BASE TEC-Tec'!J323=\"\",\"\",'BASE TEC-Tec'!J323)","v":"transfert modal"},"moitié"]
[{"$f":"'BASE TEC-Tec'!B324","v":"disponibilité de transports en commun"},{"$f":"IF('BASE TEC-Tec'!J324=\"\",\"\",'BASE TEC-Tec'!J324)","v":"transfert modal"},{"$f":"IF('BASE TEC-Tec'!K324=\"\",\"\",'BASE TEC-Tec'!K324)","v":0.4}]
[{"$f":"'BASE TEC-Tec'!D326","v":"aucune"},"coefficient",{"$f":"'BASE TEC-Tec'!E326","v":0}]
[{"$f":"'BASE TEC-Tec'!D327","v":"faible"},"coefficient",{"$f":"'BASE TEC-Tec'!E327","v":0.2}]
[{"$f":"'BASE TEC-Tec'!D328","v":"une ligne à proximité"},"coefficient",{"$f":"'BASE TEC-Tec'!E328","v":0.5}]
[{"$f":"'BASE TEC-Tec'!D329","v":"maillage à proximité"},"coefficient",{"$f":"'BASE TEC-Tec'!E329","v":1}]
[{"$f":"'BASE TEC-Tec'!B330","v":"emplacements de voitures électriques"},{"$f":"IF('BASE TEC-Tec'!J330=\"\",\"\",'BASE TEC-Tec'!J330)","v":"transfert modal"},{"$f":"IF('BASE TEC-Tec'!K330=\"\",\"\",'BASE TEC-Tec'!K330)","v":0.1}]
[{"$f":"'BASE TEC-Tec'!D332","v":"aucun"},"coefficient",{"$f":"'BASE TEC-Tec'!E332","v":0}]
[{"$f":"'BASE TEC-Tec'!D333","v":"symboliques"},"coefficient",{"$f":"'BASE TEC-Tec'!E333","v":0.2}]
[{"$f":"'BASE TEC-Tec'!D334","v":"nombreux"},"coefficient",{"$f":"'BASE TEC-Tec'!E334","v":0.5}]
[{"$f":"'BASE TEC-Tec'!D335","v":"nombreux + pool de VE"},"coefficient",{"$f":"'BASE TEC-Tec'!E335","v":1}]
[{"$f":"'BASE TEC-Tec'!B336","v":"emplacements pour deux-roues"},{"$f":"IF('BASE TEC-Tec'!J336=\"\",\"\",'BASE TEC-Tec'!J336)","v":"transfert modal"},{"$f":"IF('BASE TEC-Tec'!K336=\"\",\"\",'BASE TEC-Tec'!K336)","v":0.3}]
[{"$f":"'BASE TEC-Tec'!D338","v":"aucun"},"coefficient",{"$f":"'BASE TEC-Tec'!E338","v":0}]
[{"$f":"'BASE TEC-Tec'!D339","v":"abri mis en valeur"},"coefficient",{"$f":"'BASE TEC-Tec'!E339","v":0.5}]
[{"$f":"'BASE TEC-Tec'!D340","v":"local sécurisé et bornes élec."},"coefficient",{"$f":"'BASE TEC-Tec'!E340","v":0.8}]
[{"$f":"'BASE TEC-Tec'!D341","v":"local sécurisé et offre de VAE"},"coefficient",{"$f":"'BASE TEC-Tec'!E341","v":1}]
[{"$f":"'BASE TEC-Tec'!B342","v":"Visiteurs"},{"$f":"IF('BASE TEC-Tec'!J342=\"\",\"\",'BASE TEC-Tec'!J342)","v":""},{"$f":"IF('BASE TEC-Tec'!K342=\"\",\"\",'BASE TEC-Tec'!K342)","v":""}]
["densité avant répartition des déplacements","m² / personne",5]
[{"$f":"'BASE TEC-Tec'!B343","v":"distance moyenne du trajet"},{"$f":"IF('BASE TEC-Tec'!J343=\"\",\"\",'BASE TEC-Tec'!J343)","v":"kg CO2e / km aller"},{"$f":"IF('BASE TEC-Tec'!K343=\"\",\"\",'BASE TEC-Tec'!K343)","v":80}]
[{"$f":"'BASE TEC-Tec'!B344","v":"disponibilité de transports en commun"},{"$f":"IF('BASE TEC-Tec'!J344=\"\",\"\",'BASE TEC-Tec'!J344)","v":"transfert modal"},{"$f":"IF('BASE TEC-Tec'!K344=\"\",\"\",'BASE TEC-Tec'!K344)","v":0.2}]
[{"$f":"'BASE TEC-Tec'!D346","v":"aucune"},"coefficient",{"$f":"'BASE TEC-Tec'!E346","v":0}]
[{"$f":"'BASE TEC-Tec'!D347","v":"faible"},"coefficient",{"$f":"'BASE TEC-Tec'!E347","v":0.2}]
[{"$f":"'BASE TEC-Tec'!D348","v":"une ligne à proximité"},"coefficient",{"$f":"'BASE TEC-Tec'!E348","v":0.5}]
[{"$f":"'BASE TEC-Tec'!D349","v":"maillage à proximité"},"coefficient",{"$f":"'BASE TEC-Tec'!E349","v":1}]
[{"$f":"'BASE TEC-Tec'!B350","v":"emplacements de voitures électriques"},{"$f":"IF('BASE TEC-Tec'!J350=\"\",\"\",'BASE TEC-Tec'!J350)","v":"transfert modal"},{"$f":"IF('BASE TEC-Tec'!K350=\"\",\"\",'BASE TEC-Tec'!K350)","v":0.1}]
[{"$f":"'BASE TEC-Tec'!D352","v":"aucun"},"coefficient",{"$f":"'BASE TEC-Tec'!E352","v":0}]
[{"$f":"'BASE TEC-Tec'!D353","v":"symboliques"},"coefficient",{"$f":"'BASE TEC-Tec'!E353","v":0.2}]
[{"$f":"'BASE TEC-Tec'!D354","v":"nombreux"},"coefficient",{"$f":"'BASE TEC-Tec'!E354","v":0.5}]
[{"$f":"'BASE TEC-Tec'!D355","v":"nombreux + pool de VE"},"coefficient",{"$f":"'BASE TEC-Tec'!E355","v":1}]
[{"$f":"'BASE TEC-Tec'!B356","v":"emplacements pour deux-roues"},{"$f":"IF('BASE TEC-Tec'!J356=\"\",\"\",'BASE TEC-Tec'!J356)","v":"transfert modal"},{"$f":"IF('BASE TEC-Tec'!K356=\"\",\"\",'BASE TEC-Tec'!K356)","v":0.2}]
[{"$f":"'BASE TEC-Tec'!D358","v":"aucun"},"coefficient",{"$f":"'BASE TEC-Tec'!E358","v":0}]
[{"$f":"'BASE TEC-Tec'!D359","v":"abri mis en valeur"},"coefficient",{"$f":"'BASE TEC-Tec'!E359","v":0.5}]
[{"$f":"'BASE TEC-Tec'!D360","v":"local sécurisé et bornes élec."},"coefficient",{"$f":"'BASE TEC-Tec'!E360","v":0.8}]
[{"$f":"'BASE TEC-Tec'!D361","v":"local sécurisé et offre de VAE"},"coefficient",{"$f":"'BASE TEC-Tec'!E361","v":1}]
[]
["AUTRES SERVICES",{"$f":"IF('BASE TEC-Tec'!J363=\"\",\"\",'BASE TEC-Tec'!J363)","v":""},{"$f":"IF('BASE TEC-Tec'!K363=\"\",\"\",'BASE TEC-Tec'!K363)","v":""}]
[{"$f":"'BASE TEC-Tec'!B369","v":"Restauration du midi"},{"$f":"IF('BASE TEC-Tec'!J369=\"\",\"\",'BASE TEC-Tec'!J369)","v":"repas moyen"},{"$f":"IF('BASE TEC-Tec'!K369=\"\",\"\",'BASE TEC-Tec'!K369)","v":2.27}]
[{"$f":"'BASE TEC-Tec'!B370","v":"apportée du domicile"},{"$f":"IF('BASE TEC-Tec'!J370=\"\",\"\",'BASE TEC-Tec'!J370)","v":"kgCO2e / repas"},{"$f":"IF('BASE TEC-Tec'!K370=\"\",\"\",'BASE TEC-Tec'!K370)","v":0.54}]
[{"$f":"'BASE TEC-Tec'!B371","v":"livrée individuellement"},{"$f":"IF('BASE TEC-Tec'!J371=\"\",\"\",'BASE TEC-Tec'!J371)","v":"kgCO2e / repas"},{"$f":"IF('BASE TEC-Tec'!K371=\"\",\"\",'BASE TEC-Tec'!K371)","v":1.04}]
[{"$f":"'BASE TEC-Tec'!B372","v":"de proximité à pieds"},{"$f":"IF('BASE TEC-Tec'!J372=\"\",\"\",'BASE TEC-Tec'!J372)","v":"kgCO2e / repas"},{"$f":"IF('BASE TEC-Tec'!K372=\"\",\"\",'BASE TEC-Tec'!K372)","v":0.54}]
[{"$f":"'BASE TEC-Tec'!B373","v":"aux alentours en voiture"},{"$f":"IF('BASE TEC-Tec'!J373=\"\",\"\",'BASE TEC-Tec'!J373)","v":"kgCO2e / repas"},{"$f":"IF('BASE TEC-Tec'!K373=\"\",\"\",'BASE TEC-Tec'!K373)","v":1.54}]
[{"$f":"'BASE TEC-Tec'!B374","v":"en cafétéria standard"},{"$f":"IF('BASE TEC-Tec'!J374=\"\",\"\",'BASE TEC-Tec'!J374)","v":"kgCO2e / repas"},{"$f":"IF('BASE TEC-Tec'!K374=\"\",\"\",'BASE TEC-Tec'!K374)","v":-0.2}]
[{"$f":"'BASE TEC-Tec'!B375","v":"en cafétéria bas carbone"},{"$f":"IF('BASE TEC-Tec'!J375=\"\",\"\",'BASE TEC-Tec'!J375)","v":"kgCO2e / repas"},{"$f":"IF('BASE TEC-Tec'!K375=\"\",\"\",'BASE TEC-Tec'!K375)","v":-1.2349999999999999}]
[{"$f":"'BASE TEC-Tec'!B376","v":"Activité commerciale"},{"$f":"IF('BASE TEC-Tec'!J376=\"\",\"\",'BASE TEC-Tec'!J376)","v":""},{"$f":"IF('BASE TEC-Tec'!K376=\"\",\"\",'BASE TEC-Tec'!K376)","v":""}]
[{"$f":"'BASE TEC-Tec'!B377","v":"surface de vente alimentaire"},{"$f":"IF('BASE TEC-Tec'!J377=\"\",\"\",'BASE TEC-Tec'!J377)","v":"kgCO2e / m²"},{"$f":"IF('BASE TEC-Tec'!K377=\"\",\"\",'BASE TEC-Tec'!K377)","v":600}]
[{"$f":"'BASE TEC-Tec'!B378","v":"surface de vente non alimentaire"},{"$f":"IF('BASE TEC-Tec'!J378=\"\",\"\",'BASE TEC-Tec'!J378)","v":"kgCO2e / m²"},{"$f":"IF('BASE TEC-Tec'!K378=\"\",\"\",'BASE TEC-Tec'!K378)","v":200}]
[{"$f":"'BASE TEC-Tec'!B379","v":"Adduction d'eau"},{"$f":"IF('BASE TEC-Tec'!J379=\"\",\"\",'BASE TEC-Tec'!J379)","v":""},{"$f":"IF('BASE TEC-Tec'!K379=\"\",\"\",'BASE TEC-Tec'!K379)","v":""}]
[{"$f":"'BASE TEC-Tec'!B380","v":"consommation annuelle eau de réseau"},{"$f":"IF('BASE TEC-Tec'!J380=\"\",\"\",'BASE TEC-Tec'!J380)","v":"kg CO2e / m³"},{"$f":"IF('BASE TEC-Tec'!K380=\"\",\"\",'BASE TEC-Tec'!K380)","v":0.2}]
[{"$f":"'BASE TEC-Tec'!B381","v":"récupération et réutilisation d'eau pluviale"},{"$f":"IF('BASE TEC-Tec'!J381=\"\",\"\",'BASE TEC-Tec'!J381)","v":"kg CO2e / m³"},{"$f":"IF('BASE TEC-Tec'!K381=\"\",\"\",'BASE TEC-Tec'!K381)","v":0.05}]
[{"$f":"'BASE TEC-Tec'!D383","v":"non"},"coefficient",{"$f":"'BASE TEC-Tec'!E383","v":0}]
[{"$f":"'BASE TEC-Tec'!D384","v":"partielle"},"coefficient",{"$f":"'BASE TEC-Tec'!E384","v":0.2}]
[{"$f":"'BASE TEC-Tec'!D385","v":"totale"},"coefficient",{"$f":"'BASE TEC-Tec'!E385","v":0.8}]
[{"$f":"'BASE TEC-Tec'!B386","v":"Traitement des déchets"},{"$f":"IF('BASE TEC-Tec'!J386=\"\",\"\",'BASE TEC-Tec'!J386)","v":""},{"$f":"IF('BASE TEC-Tec'!K386=\"\",\"\",'BASE TEC-Tec'!K386)","v":""}]
[{"$f":"'BASE TEC-Tec'!B387","v":"production annuelle"},{"$f":"IF('BASE TEC-Tec'!J387=\"\",\"\",'BASE TEC-Tec'!J387)","v":"kg CO2e / t"},{"$f":"IF('BASE TEC-Tec'!K387=\"\",\"\",'BASE TEC-Tec'!K387)","v":250}]
[{"$f":"'BASE TEC-Tec'!B388","v":"tri sélectif"},{"$f":"IF('BASE TEC-Tec'!J388=\"\",\"\",'BASE TEC-Tec'!J388)","v":"kg CO2e / t"},{"$f":"IF('BASE TEC-Tec'!K388=\"\",\"\",'BASE TEC-Tec'!K388)","v":50}]
[{"$f":"'BASE TEC-Tec'!D390","v":"sans"},"coefficient",{"$f":"'BASE TEC-Tec'!E390","v":0}]
[{"$f":"'BASE TEC-Tec'!D391","v":"partiel"},"coefficient",{"$f":"'BASE TEC-Tec'!E391","v":0.2}]
[{"$f":"'BASE TEC-Tec'!D392","v":"total"},"coefficient",{"$f":"'BASE TEC-Tec'!E392","v":0.8}]
[null,null,{"$f":"IF('BASE TEC-Tec'!#REF!=\"\",\"\",'BASE TEC-Tec'!#REF!)","v":{"$error":"#REF!"}}]
["DIVERS",{"$f":"'BASE TEC-Tec'!F398","v":"Répartition des déplacements"},null,null,{"$f":"'BASE TEC-Tec'!I398","v":"Repas"},{"$f":"'BASE TEC-Tec'!K398","v":"Conso. des prises de courant"}]
[{"$f":"'BASE TEC-Tec'!B400","v":"type de bâtiment"},{"$f":"'BASE TEC-Tec'!F399","v":"personnel"},{"$f":"'BASE TEC-Tec'!G399","v":"élèves"},{"$f":"'BASE TEC-Tec'!H399","v":"visiteurs"},{"$f":"'BASE TEC-Tec'!I399","v":"nombre\npour 1000 m²"},{"$f":"'BASE TEC-Tec'!K399","v":"permanentes"},{"$f":"'BASE TEC-Tec'!L399","v":"intermittentes"}]
[{"$f":"'BASE TEC-Tec'!E400","v":"Immeuble de bureaux"},{"$f":"'BASE TEC-Tec'!F400","v":0.9},{"$f":"'BASE TEC-Tec'!G400","v":0},{"$f":"'BASE TEC-Tec'!H400","v":0.1},{"$f":"'BASE TEC-Tec'!I400","v":50},{"$f":"'BASE TEC-Tec'!K400","v":15},{"$f":"'BASE TEC-Tec'!L400","v":15}]
[{"$f":"'BASE TEC-Tec'!E401","v":"Établissement scolaire"},{"$f":"'BASE TEC-Tec'!F401","v":0.05},{"$f":"'BASE TEC-Tec'!G401","v":0.95},{"$f":"'BASE TEC-Tec'!H401","v":0},{"$f":"'BASE TEC-Tec'!I401","v":400},{"$f":"'BASE TEC-Tec'!K401","v":4},{"$f":"'BASE TEC-Tec'!L401","v":4}]
[{"$f":"'BASE TEC-Tec'!E402","v":"Université"},{"$f":"'BASE TEC-Tec'!F402","v":0.1},{"$f":"'BASE TEC-Tec'!G402","v":0.4},{"$f":"'BASE TEC-Tec'!H402","v":0.1},{"$f":"'BASE TEC-Tec'!I402","v":300},{"$f":"'BASE TEC-Tec'!K402","v":4},{"$f":"'BASE TEC-Tec'!L402","v":4}]
[{"$f":"'BASE TEC-Tec'!E403","v":"Autre tertiaire"},{"$f":"'BASE TEC-Tec'!F403","v":0.05},{"$f":"'BASE TEC-Tec'!G403","v":0},{"$f":"'BASE TEC-Tec'!H403","v":0.95},{"$f":"'BASE TEC-Tec'!I403","v":100},{"$f":"'BASE TEC-Tec'!K403","v":4},{"$f":"'BASE TEC-Tec'!L403","v":4}]